{"text_format":"1","workbook":"xlsx","n_sheets":6,"sheets":["FRONT PAGE","Input","Tables (3)","Tables","Summary","Report"],"not_rendered":{"charts":0,"images":14,"macros":1,"external_links":0,"defined_names":81,"comments":3,"pivot_tables":0},"unopened":[],"bounds":{"document_bytes":16777216,"sheet_cells":100000,"rows_first":2000,"rows_last":500,"rows_between":2000,"halvings":0,"cell_chars":16384,"cell_head_chars":4096},"cells_cut":0,"cells_raw":0,"read":"whole","date_system":"1900"}

{"sheet":"FRONT PAGE","index":0,"n_rows":38,"n_cols":7,"rows_kept":38,"cut":false,"hidden":false,"merged":[[18,2,22,8],[46,4,46,5],[46,6,46,7],[36,2,36,3],[30,6,33,8],[37,5,37,8]]}
[]
[]
[]
[]
[]
[]
[]
[null,null,"Commercial Lighting Calculation Tool v8.0"]
[null,null,"Published: 8 May 2023"]
[null,null,"Rule version: 14 April 2023"]
[]
[]
[]
[]
[]
[]
[]
[null,null,"** TO USE THIS CALCULATOR IT MUST BE SAVED ON YOUR LOCAL COMPUTER"]
[null,null,"This calculator calculates Electricity Savings from a lighting upgrade using the Commercial Lighting Energy Savings Formula (clause 9.4 of the ESS Rule) as at 14 April 2023.\nThe calculated electricity savings can be entered into the Implementation Data Sheet as part of an application to register ESCs.  The CLCT also provides the indicative number of Energy Savings Certificates that will be created.  This number is a guide, and due to rounding is only accurate where an application to register ESCs includes only the Electricity Savings from this lighting upgrade.\nThis tool is provided for assistance only.  Accredited Certificate Providers must ensure all ESCs they create are created in accordance with the Electricity Supply Act 1995, the Electricity Supply (General) Regulation 2014, the ESS Rule and conditions of accreditation.  "]
[]
[]
[]
[]
[]
[]
[]
[]
[]
[]
[]
[null,null,null,"APPLICATION",{"$f":"IF(Input!A1=\"\",\"\",Input!A1)","v":""},null,"* Note:  The number of ESCs shown below is accurate if you register the ESCs for this Implementation only.  If you register ESCs for multiple Implementations, as a single batch, sum the total Electricity Savings across all Implementations before calculating ESCs."]
[null,null,null,"SITE NAME",{"$f":"IF(Input!A2=\"\",\"\",Input!A2)","v":""}]
[null,null,null,"SITE ADDRESS",{"$f":"IF(Input!A3=\"\",\"\",Input!A3)","v":""}]
[null,null,null,"REGIONAL NETWORK FACTOR",{"$f":"IF(Input!G2 <> \"\",Input!G2,1)","v":1}]
[]
[null,null,null,"ELECTRICITY SAVINGS",{"$f":"ROUND(SUM(Input!AW7:AW99),2)","v":0},"MWh (For ESC registrations from 14 April 2023, Electricity Savings calculated excludes the Regional Network Factor)"]
[null,null,"ESCs CREATED*",null,{"$f":"IF(E36<0,\"NoSavings\",ROUNDDOWN(E36*Tables!B1*E34,0))","v":0},"Certificates"]
[null,null,null,"MINIMUM PURCHASE COST (Excl GST)",{"$f":"IF(($E$36*5)>0,$E$36*5,0)","v":0},"Any rebate or credit made or offered to the \nPurchaser (by any party) cannot reduce the net amount paid below this amount"]

{"sheet":"Input","index":1,"n_rows":108,"n_cols":84,"rows_kept":108,"cut":false,"hidden":false,"merged":[[0,2,0,3],[4,11,4,18],[4,50,4,53],[4,41,4,42],[2,28,2,29],[4,26,4,27],[4,28,4,29],[4,39,4,40],[4,0,4,9]]}
[null,"End Application","Accreditation Date",null,"Imp Date","Nomination Date","Regional Network Factor","Implementation ID",null,null,null,null,null,null,null,null,null,null,null,null,null,null,null,null,null,null,{"$f":"C7*F7","v":0},{"$f":"(L7*(Y7-1)+Z7)*C7","v":{"$error":"#VALUE!"}}]
[null,3000]
[null,"Address"]
[1,2,3,4,5,6,7,8,9,10,11,12,13,14,15,16,17,18,19,20,21,22,23,24,25,26,27,28,29,30,31,32,33,34,35,36,37,38,39,40,41,42,43,44,45,46,47,48,49,50,51,52,53,54,55,56,57,58,59,60,61,62,65,67,69,71,73,75,77,"1900-03-19",81,83,85,87]
["Old Lighting Installation",null,null,null,null,null,null,null,null,null,null,"New lighting installation",null,null,null,null,null,null,null,null,null,null,null,null,null,null,"LCP ",null,"Lifetimes",null,null,null,null,null,null,null,null,null,null,"LCP",null,"Lifetimes",null,null,null,null,null,null,null,null,"LIFETIME SPECIFICATION PARAMETERS",null,null,null,null,null,null,null,null,null,null,"2012-01-01"]
["Space Group","Area","No. lamps","Lamps are outdoor","Lamp type","Nominal lamp power (W)","Ballast/ transformer type","Control system-1","Control system-2","Air conditioned space","Space Type","No. lamps",null,"Lamp type","Nominal lamp power (W)","Ballast/ transformer type","Control system-1","Control system-2","Air conditioned space","Date of Implementation","Baseline - Upgrade (MWh)","ESCs","Annual Operating Hours","Lamp & ballast/ transformer","M value","C value","Lamp (W)","Control Gear (W)","Lamp Lifetime (yrs)","Control Gear Lifetime (yrs)","Operating hrs/yr","CM","AM","LCP\nLow (W)","Energy 'Before' (MWh)",null,"Lamp & ballast/ transformer","M value","C value","Lamp Circuit Power (W)","Control Gear (W)","Lamp Lifetime (yrs)","Control Gear Lifetime (yrs)","Operating hrs/yr","CM","AM","LCP\nLow (W)","Energy 'After' (MWh)","Saving (MWh) Without RNF","Saving  (MWh) With RNF","Only Globes","Only Control System","Higher Power Replacement","Lifetime of Lamp","Brand","Model No","Supplier Code ","Easily Replaced (Not Reversible) ","Date Acceptance Letter","Accreditation Date ","Date of Approval","ESCs Vintage ","Project's Implementation Date ","Project Lifetime Factor","Total lifetime of the project (Days)","Project Lifetime","Entitlement Date ","Effective Start Date","Effective Entitlement Length","Vintage Dependent Start Date","Eligible Days  in vintage","% of  potential ESCs (prorated) ","ED Check ","Vintage Check"]
[null,null,null,null,null,null,null,null,null,null,null,null,null,null,null,null,null,null,null,null,{"$f":"IF(AW7<>\"\",AW7, \"\")","v":""},{"$f":"IF(U7<>\"\", U7*$G$2*Tables!$B$1,\"\")","v":""},null,{"$f":"IF(E7<>\"\", CONCATENATE(E7,\"-\",G7),\"\")","v":""},{"$f":"IF($E7<>\"\",VLOOKUP(Input!$X7,Tables!$E$5:$G$200,2,FALSE), \"\")","v":""},{"$f":"IF($F7=\"\",\"\", VLOOKUP(Input!$X7,Tables!$E$5:$G$200,3,FALSE))","v":""},{"$f":"IF($E7<>\"\",C7*(Y7*F7), \"\")","v":""},{"$f":"IF(X7<>\"\",C7*Z7,\"\")","v":""},10,10,{"$f":"IF(W7=\"\",\"\",W7)","v":""},1,{"$f":"IF($E7<>\"\",VLOOKUP(Input!J7,Tables!$L$5:$M$9,2,FALSE), \"\")","v":""},null,{"$f":"IF($E7<>\"\",((AA7*AC7+AB7*AD7)*AE7*AF7*AG7)/10^6, \"\")","v":""},null,{"$f":"IF(N7<>\"\", CONCATENATE(N7,\"-\",P7),\"\")","v":""},{"$f":"IF($N7<>\"\",VLOOKUP(Input!$AK7,Tables!$E$5:$G$200,2,FALSE), \"\")","v":""},{"$f":"IF($O7=\"\",\"\",VLOOKUP(Input!$AK7,Tables!$E$5:$G$200,3,FALSE))","v":""},{"$f":"IF($E7<>\"\",L7*(AL7*O7), \"\")","v":""},{"$f":"IF(AK7<>\"\",AM7*L7,\"\")","v":""},{"$f":"IF(AC7<>\"\",AC7,\"\")","v":10},{"$f":"IF(AD7<>\"\",AD7,\"\")","v":10},{"$f":"IF(W7=\"\",\"\",W7)","v":""},1,{"$f":"IF($O7<>\"\",VLOOKUP(Input!S7,Tables!$L$5:$M$9,2,FALSE), \"\")","v":""},null,{"$f":"IF($E7<>\"\",(AN7*AP7+AO7*AQ7)*AR7*AS7*AT7/10^6, \"\")","v":""},{"$f":"IF($O7<>\"\",AI7-AV7,\"\")","v":""},{"$f":"IF($O7<>\"\",AW7*G$2,\"\")","v":""},"N","N","N","N/A","x","x",null,null,null,null,null,null,{"$f":"T7","v":"00:00:00"},{"$f":"MIN(AC7,AD7)/Tables!B$3","v":1},{"$f":"(((DATE(YEAR(BK7)+Tables!$B$3,MONTH(BK7),DAY(BK7))-BK7)*BL7))","v":3653},{"$f":"BK7+BM7","v":"1909-12-31"},{"$f":"BH7","v":"00:00:00"},{"$f":"IF(BK7>=BO7,BK7,BO7)","v":"00:00:00"},{"$f":"BN7-BP7","v":3653},{"$f":"IF(BP7>$BJ$5,BP7,$BJ$5)","v":"2012-01-01"},{"$f":"IF((BN7-BR7)<0,0,(BN7-BR7))","v":0},{"$f":"1","v":1},{"$f":"BK7-BO7","v":0},{"$f":"BK7-BR7","v":-40909},null,null,null,null,null,null,null,null,{"$f":"IF($O7=\"\",\"\",IF(AY7=\"N\",IF(AZ7=\"N\",IF(BA7=\"N\",\"NO\",\"YES\"),\"YES\"),\"YES\"))","v":""},{"$f":"IF($O7=\"\",\"\",IF(YEAR(BK7)>YEAR($BJ$5),YEAR(BK7),YEAR($BJ$5)))","v":""}]
[null,null,null,null,null,null,null,null,null,null,null,null,null,null,null,null,null,null,null,null,"",{"$f":"IF(U8<>\"\", U8*$G$2*Tables!$B$1,\"\")","v":""},null,"",{"$f":"IF($E8<>\"\",VLOOKUP(Input!$X8,Tables!$E$5:$G$200,2,FALSE), \"\")","v":""},{"$f":"IF($F8=\"\",\"\", VLOOKUP(Input!$X8,Tables!$E$5:$G$200,3,FALSE))","v":""},"","",10,10,"",1,{"$f":"IF($E8<>\"\",VLOOKUP(Input!J8,Tables!$L$5:$M$9,2,FALSE), \"\")","v":""},null,"",null,"",{"$f":"IF($N8<>\"\",VLOOKUP(Input!$AK8,Tables!$E$5:$G$200,2,FALSE), \"\")","v":""},{"$f":"IF($O8=\"\",\"\",VLOOKUP(Input!$AK8,Tables!$E$5:$G$200,3,FALSE))","v":""},"","",10,10,"",1,{"$f":"IF($O8<>\"\",VLOOKUP(Input!S8,Tables!$L$5:$M$9,2,FALSE), \"\")","v":""},null,"","","","N","N","N","N/A","u","u",null,null,null,null,null,null,{"$f":"T8","v":"00:00:00"},{"$f":"MIN(AC8,AD8)/Tables!B$3","v":1},{"$f":"(((DATE(YEAR(BK8)+Tables!$B$3,MONTH(BK8),DAY(BK8))-BK8)*BL8))","v":3653},"1909-12-31",{"$f":"BH8","v":"00:00:00"},{"$f":"IF(BK8>=BO8,BK8,BO8)","v":"00:00:00"},3653,{"$f":"IF(BP8>$BJ$5,BP8,$BJ$5)","v":"2012-01-01"},0,{"$f":"1","v":1},{"$f":"BK8-BO8","v":0},{"$f":"BK8-BR8","v":-40909},null,null,null,null,null,null,null,null,{"$f":"IF($O8=\"\",\"\",IF(AY8=\"N\",IF(AZ8=\"N\",IF(BA8=\"N\",\"NO\",\"YES\"),\"YES\"),\"YES\"))","v":""},{"$f":"IF($O8=\"\",\"\",IF(YEAR(BK8)>YEAR($BJ$5),YEAR(BK8),YEAR($BJ$5)))","v":""}]
[null,null,null,null,null,null,null,null,null,null,null,null,null,null,null,null,null,null,null,null,"",{"$f":"IF(U9<>\"\", U9*$G$2*Tables!$B$1,\"\")","v":""},null,"",{"$f":"IF($E9<>\"\",VLOOKUP(Input!$X9,Tables!$E$5:$G$200,2,FALSE), \"\")","v":""},{"$f":"IF($F9=\"\",\"\", VLOOKUP(Input!$X9,Tables!$E$5:$G$200,3,FALSE))","v":""},"","",null,null,"",null,{"$f":"IF($E9<>\"\",VLOOKUP(Input!J9,Tables!$L$5:$M$9,2,FALSE), \"\")","v":""},null,"",null,"",{"$f":"IF($N9<>\"\",VLOOKUP(Input!$AK9,Tables!$E$5:$G$200,2,FALSE), \"\")","v":""},{"$f":"IF($O9=\"\",\"\",VLOOKUP(Input!$AK9,Tables!$E$5:$G$200,3,FALSE))","v":""},"","","","","",null,{"$f":"IF($O9<>\"\",VLOOKUP(Input!S9,Tables!$L$5:$M$9,2,FALSE), \"\")","v":""},null,"","","",null,null,null,null,null,null,null,null,null,null,null,null,{"$f":"T9","v":"00:00:00"},{"$f":"MIN(AC9,AD9)/Tables!B$3","v":0},{"$f":"(((DATE(YEAR(BK9)+Tables!$B$3,MONTH(BK9),DAY(BK9))-BK9)*BL9))","v":0},"00:00:00",{"$f":"BH9","v":"00:00:00"},"00:00:00",0,{"$f":"IF(BP9>$BJ$5,BP9,$BJ$5)","v":"2012-01-01"},0,{"$f":"1","v":1},0,-40909,null,null,null,null,null,null,null,null,"",""]
[null,null,null,null,null,null,null,null,null,null,null,null,null,null,null,null,null,null,null,null,"",{"$f":"IF(U10<>\"\", U10*$G$2*Tables!$B$1,\"\")","v":""},null,"",{"$f":"IF($E10<>\"\",VLOOKUP(Input!$X10,Tables!$E$5:$G$200,2,FALSE), \"\")","v":""},{"$f":"IF($F10=\"\",\"\", VLOOKUP(Input!$X10,Tables!$E$5:$G$200,3,FALSE))","v":""},"","",null,null,"",null,{"$f":"IF($E10<>\"\",VLOOKUP(Input!J10,Tables!$L$5:$M$9,2,FALSE), \"\")","v":""},null,"",null,"",{"$f":"IF($N10<>\"\",VLOOKUP(Input!$AK10,Tables!$E$5:$G$200,2,FALSE), \"\")","v":""},{"$f":"IF($O10=\"\",\"\",VLOOKUP(Input!$AK10,Tables!$E$5:$G$200,3,FALSE))","v":""},"","","","","",null,{"$f":"IF($O10<>\"\",VLOOKUP(Input!S10,Tables!$L$5:$M$9,2,FALSE), \"\")","v":""},null,"","","",null,null,null,null,null,null,null,null,null,null,null,null,{"$f":"T10","v":"00:00:00"},{"$f":"MIN(AC10,AD10)/Tables!B$3","v":0},{"$f":"(((DATE(YEAR(BK10)+Tables!$B$3,MONTH(BK10),DAY(BK10))-BK10)*BL10))","v":0},"00:00:00",{"$f":"BH10","v":"00:00:00"},"00:00:00",0,{"$f":"IF(BP10>$BJ$5,BP10,$BJ$5)","v":"2012-01-01"},0,{"$f":"1","v":1},0,-40909,null,null,null,null,null,null,null,null,"",""]
[null,null,null,null,null,null,null,null,null,null,null,null,null,null,null,null,null,null,null,null,"",{"$f":"IF(U11<>\"\", U11*$G$2*Tables!$B$1,\"\")","v":""},null,"",{"$f":"IF($E11<>\"\",VLOOKUP(Input!$X11,Tables!$E$5:$G$200,2,FALSE), \"\")","v":""},{"$f":"IF($F11=\"\",\"\", VLOOKUP(Input!$X11,Tables!$E$5:$G$200,3,FALSE))","v":""},"","",null,null,"",null,{"$f":"IF($E11<>\"\",VLOOKUP(Input!J11,Tables!$L$5:$M$9,2,FALSE), \"\")","v":""},null,"",null,"",{"$f":"IF($N11<>\"\",VLOOKUP(Input!$AK11,Tables!$E$5:$G$200,2,FALSE), \"\")","v":""},{"$f":"IF($O11=\"\",\"\",VLOOKUP(Input!$AK11,Tables!$E$5:$G$200,3,FALSE))","v":""},"","","","","",null,{"$f":"IF($O11<>\"\",VLOOKUP(Input!S11,Tables!$L$5:$M$9,2,FALSE), \"\")","v":""},null,"","","",null,null,null,null,null,null,null,null,null,null,null,null,{"$f":"T11","v":"00:00:00"},{"$f":"MIN(AC11,AD11)/Tables!B$3","v":0},{"$f":"(((DATE(YEAR(BK11)+Tables!$B$3,MONTH(BK11),DAY(BK11))-BK11)*BL11))","v":0},"00:00:00",{"$f":"BH11","v":"00:00:00"},"00:00:00",0,{"$f":"IF(BP11>$BJ$5,BP11,$BJ$5)","v":"2012-01-01"},0,{"$f":"1","v":1},0,-40909,null,null,null,null,null,null,null,null,"",""]
[null,null,null,null,null,null,null,null,null,null,null,null,null,null,null,null,null,null,null,null,"",{"$f":"IF(U12<>\"\", U12*$G$2*Tables!$B$1,\"\")","v":""},null,"",{"$f":"IF($E12<>\"\",VLOOKUP(Input!$X12,Tables!$E$5:$G$200,2,FALSE), \"\")","v":""},{"$f":"IF($F12=\"\",\"\", VLOOKUP(Input!$X12,Tables!$E$5:$G$200,3,FALSE))","v":""},"","",null,null,"",null,{"$f":"IF($E12<>\"\",VLOOKUP(Input!J12,Tables!$L$5:$M$9,2,FALSE), \"\")","v":""},null,"",null,"",{"$f":"IF($N12<>\"\",VLOOKUP(Input!$AK12,Tables!$E$5:$G$200,2,FALSE), \"\")","v":""},{"$f":"IF($O12=\"\",\"\",VLOOKUP(Input!$AK12,Tables!$E$5:$G$200,3,FALSE))","v":""},"","","","","",null,{"$f":"IF($O12<>\"\",VLOOKUP(Input!S12,Tables!$L$5:$M$9,2,FALSE), \"\")","v":""},null,"","","",null,null,null,null,null,null,null,null,null,null,null,null,{"$f":"T12","v":"00:00:00"},{"$f":"MIN(AC12,AD12)/Tables!B$3","v":0},{"$f":"(((DATE(YEAR(BK12)+Tables!$B$3,MONTH(BK12),DAY(BK12))-BK12)*BL12))","v":0},"00:00:00",{"$f":"BH12","v":"00:00:00"},"00:00:00",0,{"$f":"IF(BP12>$BJ$5,BP12,$BJ$5)","v":"2012-01-01"},0,{"$f":"1","v":1},0,-40909,null,null,null,null,null,null,null,null,"",""]
[null,null,null,null,null,null,null,null,null,null,null,null,null,null,null,null,null,null,null,null,"",{"$f":"IF(U13<>\"\", U13*$G$2*Tables!$B$1,\"\")","v":""},null,"",{"$f":"IF($E13<>\"\",VLOOKUP(Input!$X13,Tables!$E$5:$G$200,2,FALSE), \"\")","v":""},{"$f":"IF($F13=\"\",\"\", VLOOKUP(Input!$X13,Tables!$E$5:$G$200,3,FALSE))","v":""},"","",null,null,"",null,{"$f":"IF($E13<>\"\",VLOOKUP(Input!J13,Tables!$L$5:$M$9,2,FALSE), \"\")","v":""},null,"",null,"",{"$f":"IF($N13<>\"\",VLOOKUP(Input!$AK13,Tables!$E$5:$G$200,2,FALSE), \"\")","v":""},{"$f":"IF($O13=\"\",\"\",VLOOKUP(Input!$AK13,Tables!$E$5:$G$200,3,FALSE))","v":""},"","","","","",null,{"$f":"IF($O13<>\"\",VLOOKUP(Input!S13,Tables!$L$5:$M$9,2,FALSE), \"\")","v":""},null,"","","",null,null,null,null,null,null,null,null,null,null,null,null,"00:00:00",{"$f":"MIN(AC13,AD13)/Tables!B$3","v":0},{"$f":"(((DATE(YEAR(BK13)+Tables!$B$3,MONTH(BK13),DAY(BK13))-BK13)*BL13))","v":0},"00:00:00","00:00:00","00:00:00",0,"2012-01-01",0,{"$f":"1","v":1},0,-40909,null,null,null,null,null,null,null,null,"",""]
[null,null,null,null,null,null,null,null,null,null,null,null,null,null,null,null,null,null,null,null,"",{"$f":"IF(U14<>\"\", U14*$G$2*Tables!$B$1,\"\")","v":""},null,"",{"$f":"IF($E14<>\"\",VLOOKUP(Input!$X14,Tables!$E$5:$G$200,2,FALSE), \"\")","v":""},{"$f":"IF($F14=\"\",\"\", VLOOKUP(Input!$X14,Tables!$E$5:$G$200,3,FALSE))","v":""},"","",null,null,"",null,{"$f":"IF($E14<>\"\",VLOOKUP(Input!J14,Tables!$L$5:$M$9,2,FALSE), \"\")","v":""},null,"",null,"",{"$f":"IF($N14<>\"\",VLOOKUP(Input!$AK14,Tables!$E$5:$G$200,2,FALSE), \"\")","v":""},{"$f":"IF($O14=\"\",\"\",VLOOKUP(Input!$AK14,Tables!$E$5:$G$200,3,FALSE))","v":""},"","","","","",null,{"$f":"IF($O14<>\"\",VLOOKUP(Input!S14,Tables!$L$5:$M$9,2,FALSE), \"\")","v":""},null,"","","",null,null,null,null,null,null,null,null,null,null,null,null,"00:00:00",{"$f":"MIN(AC14,AD14)/Tables!B$3","v":0},{"$f":"(((DATE(YEAR(BK14)+Tables!$B$3,MONTH(BK14),DAY(BK14))-BK14)*BL14))","v":0},"00:00:00","00:00:00","00:00:00",0,"2012-01-01",0,{"$f":"1","v":1},0,-40909,null,null,null,null,null,null,null,null,"",""]
[null,null,null,null,null,null,null,null,null,null,null,null,null,null,null,null,null,null,null,null,"",{"$f":"IF(U15<>\"\", U15*$G$2*Tables!$B$1,\"\")","v":""},null,"",{"$f":"IF($E15<>\"\",VLOOKUP(Input!$X15,Tables!$E$5:$G$200,2,FALSE), \"\")","v":""},{"$f":"IF($F15=\"\",\"\", VLOOKUP(Input!$X15,Tables!$E$5:$G$200,3,FALSE))","v":""},"","",null,null,"",null,{"$f":"IF($E15<>\"\",VLOOKUP(Input!J15,Tables!$L$5:$M$9,2,FALSE), \"\")","v":""},null,"",null,"",{"$f":"IF($N15<>\"\",VLOOKUP(Input!$AK15,Tables!$E$5:$G$200,2,FALSE), \"\")","v":""},{"$f":"IF($O15=\"\",\"\",VLOOKUP(Input!$AK15,Tables!$E$5:$G$200,3,FALSE))","v":""},"","","","","",null,{"$f":"IF($O15<>\"\",VLOOKUP(Input!S15,Tables!$L$5:$M$9,2,FALSE), \"\")","v":""},null,"","","",null,null,null,null,null,null,null,null,null,null,null,null,"00:00:00",{"$f":"MIN(AC15,AD15)/Tables!B$3","v":0},{"$f":"(((DATE(YEAR(BK15)+Tables!$B$3,MONTH(BK15),DAY(BK15))-BK15)*BL15))","v":0},"00:00:00","00:00:00","00:00:00",0,"2012-01-01",0,{"$f":"1","v":1},0,-40909,null,null,null,null,null,null,null,null,"",""]
[null,null,null,null,null,null,null,null,null,null,null,null,null,null,null,null,null,null,null,null,"",{"$f":"IF(U16<>\"\", U16*$G$2*Tables!$B$1,\"\")","v":""},null,{"$f":"IF(E16<>\"\", CONCATENATE(E16,\"-\",G16),\"\")","v":""},{"$f":"IF($E16<>\"\",VLOOKUP(Input!$X16,Tables!$E$5:$G$200,2,FALSE), \"\")","v":""},{"$f":"IF($F16=\"\",\"\", VLOOKUP(Input!$X16,Tables!$E$5:$G$200,3,FALSE))","v":""},"","",null,null,{"$f":"IF(W16=\"\",\"\",W16)","v":""},null,{"$f":"IF($E16<>\"\",VLOOKUP(Input!J16,Tables!$L$5:$M$9,2,FALSE), \"\")","v":""},null,"",null,{"$f":"IF(N16<>\"\", CONCATENATE(N16,\"-\",P16),\"\")","v":""},{"$f":"IF($N16<>\"\",VLOOKUP(Input!$AK16,Tables!$E$5:$G$200,2,FALSE), \"\")","v":""},{"$f":"IF($O16=\"\",\"\",VLOOKUP(Input!$AK16,Tables!$E$5:$G$200,3,FALSE))","v":""},"","",{"$f":"IF(AC16<>\"\",AC16,\"\")","v":""},{"$f":"IF(AD16<>\"\",AD16,\"\")","v":""},{"$f":"IF(W16=\"\",\"\",W16)","v":""},null,{"$f":"IF($O16<>\"\",VLOOKUP(Input!S16,Tables!$L$5:$M$9,2,FALSE), \"\")","v":""},null,"","","",null,null,null,null,null,null,null,null,null,null,null,null,"00:00:00",{"$f":"MIN(AC16,AD16)/Tables!B$3","v":0},{"$f":"(((DATE(YEAR(BK16)+Tables!$B$3,MONTH(BK16),DAY(BK16))-BK16)*BL16))","v":0},"00:00:00","00:00:00","00:00:00",0,"2012-01-01",0,{"$f":"1","v":1},0,-40909,null,null,null,null,null,null,null,null,"",""]
[null,null,null,null,null,null,null,null,null,null,null,null,null,null,null,null,null,null,null,null,"",{"$f":"IF(U17<>\"\", U17*$G$2*Tables!$B$1,\"\")","v":""},null,"",{"$f":"IF($E17<>\"\",VLOOKUP(Input!$X17,Tables!$E$5:$G$200,2,FALSE), \"\")","v":""},{"$f":"IF($F17=\"\",\"\", VLOOKUP(Input!$X17,Tables!$E$5:$G$200,3,FALSE))","v":""},"","",null,null,"",null,{"$f":"IF($E17<>\"\",VLOOKUP(Input!J17,Tables!$L$5:$M$9,2,FALSE), \"\")","v":""},null,"",null,"",{"$f":"IF($N17<>\"\",VLOOKUP(Input!$AK17,Tables!$E$5:$G$200,2,FALSE), \"\")","v":""},{"$f":"IF($O17=\"\",\"\",VLOOKUP(Input!$AK17,Tables!$E$5:$G$200,3,FALSE))","v":""},"","","","","",null,{"$f":"IF($O17<>\"\",VLOOKUP(Input!S17,Tables!$L$5:$M$9,2,FALSE), \"\")","v":""},null,"","","",null,null,null,null,null,null,null,null,null,null,null,null,"00:00:00",{"$f":"MIN(AC17,AD17)/Tables!B$3","v":0},{"$f":"(((DATE(YEAR(BK17)+Tables!$B$3,MONTH(BK17),DAY(BK17))-BK17)*BL17))","v":0},"00:00:00","00:00:00","00:00:00",0,"2012-01-01",0,{"$f":"1","v":1},0,-40909,null,null,null,null,null,null,null,null,"",""]
[null,null,null,null,null,null,null,null,null,null,null,null,null,null,null,null,null,null,null,null,"",{"$f":"IF(U18<>\"\", U18*$G$2*Tables!$B$1,\"\")","v":""},null,"",{"$f":"IF($E18<>\"\",VLOOKUP(Input!$X18,Tables!$E$5:$G$200,2,FALSE), \"\")","v":""},{"$f":"IF($F18=\"\",\"\", VLOOKUP(Input!$X18,Tables!$E$5:$G$200,3,FALSE))","v":""},"","",null,null,"",null,{"$f":"IF($E18<>\"\",VLOOKUP(Input!J18,Tables!$L$5:$M$9,2,FALSE), \"\")","v":""},null,"",null,"",{"$f":"IF($N18<>\"\",VLOOKUP(Input!$AK18,Tables!$E$5:$G$200,2,FALSE), \"\")","v":""},{"$f":"IF($O18=\"\",\"\",VLOOKUP(Input!$AK18,Tables!$E$5:$G$200,3,FALSE))","v":""},"","","","","",null,{"$f":"IF($O18<>\"\",VLOOKUP(Input!S18,Tables!$L$5:$M$9,2,FALSE), \"\")","v":""},null,"","","",null,null,null,null,null,null,null,null,null,null,null,null,"00:00:00",{"$f":"MIN(AC18,AD18)/Tables!B$3","v":0},{"$f":"(((DATE(YEAR(BK18)+Tables!$B$3,MONTH(BK18),DAY(BK18))-BK18)*BL18))","v":0},"00:00:00","00:00:00","00:00:00",0,"2012-01-01",0,{"$f":"1","v":1},0,-40909,null,null,null,null,null,null,null,null,"",""]
[null,null,null,null,null,null,null,null,null,null,null,null,null,null,null,null,null,null,null,null,"",{"$f":"IF(U19<>\"\", U19*$G$2*Tables!$B$1,\"\")","v":""},null,"",{"$f":"IF($E19<>\"\",VLOOKUP(Input!$X19,Tables!$E$5:$G$200,2,FALSE), \"\")","v":""},{"$f":"IF($F19=\"\",\"\", VLOOKUP(Input!$X19,Tables!$E$5:$G$200,3,FALSE))","v":""},"","",null,null,"",null,{"$f":"IF($E19<>\"\",VLOOKUP(Input!J19,Tables!$L$5:$M$9,2,FALSE), \"\")","v":""},null,"",null,"",{"$f":"IF($N19<>\"\",VLOOKUP(Input!$AK19,Tables!$E$5:$G$200,2,FALSE), \"\")","v":""},{"$f":"IF($O19=\"\",\"\",VLOOKUP(Input!$AK19,Tables!$E$5:$G$200,3,FALSE))","v":""},"","","","","",null,{"$f":"IF($O19<>\"\",VLOOKUP(Input!S19,Tables!$L$5:$M$9,2,FALSE), \"\")","v":""},null,"","","",null,null,null,null,null,null,null,null,null,null,null,null,"00:00:00",{"$f":"MIN(AC19,AD19)/Tables!B$3","v":0},{"$f":"(((DATE(YEAR(BK19)+Tables!$B$3,MONTH(BK19),DAY(BK19))-BK19)*BL19))","v":0},"00:00:00","00:00:00","00:00:00",0,"2012-01-01",0,{"$f":"1","v":1},0,-40909,null,null,null,null,null,null,null,null,"",""]
[null,null,null,null,null,null,null,null,null,null,null,null,null,null,null,null,null,null,null,null,"",{"$f":"IF(U20<>\"\", U20*$G$2*Tables!$B$1,\"\")","v":""},null,"",{"$f":"IF($E20<>\"\",VLOOKUP(Input!$X20,Tables!$E$5:$G$200,2,FALSE), \"\")","v":""},{"$f":"IF($F20=\"\",\"\", VLOOKUP(Input!$X20,Tables!$E$5:$G$200,3,FALSE))","v":""},"","",null,null,"",null,{"$f":"IF($E20<>\"\",VLOOKUP(Input!J20,Tables!$L$5:$M$9,2,FALSE), \"\")","v":""},null,"",null,"",{"$f":"IF($N20<>\"\",VLOOKUP(Input!$AK20,Tables!$E$5:$G$200,2,FALSE), \"\")","v":""},{"$f":"IF($O20=\"\",\"\",VLOOKUP(Input!$AK20,Tables!$E$5:$G$200,3,FALSE))","v":""},"","","","","",null,{"$f":"IF($O20<>\"\",VLOOKUP(Input!S20,Tables!$L$5:$M$9,2,FALSE), \"\")","v":""},null,"","","",null,null,null,null,null,null,null,null,null,null,null,null,"00:00:00",{"$f":"MIN(AC20,AD20)/Tables!B$3","v":0},{"$f":"(((DATE(YEAR(BK20)+Tables!$B$3,MONTH(BK20),DAY(BK20))-BK20)*BL20))","v":0},"00:00:00","00:00:00","00:00:00",0,"2012-01-01",0,{"$f":"1","v":1},0,-40909,null,null,null,null,null,null,null,null,"",""]
[null,null,null,null,null,null,null,null,null,null,null,null,null,null,null,null,null,null,null,null,"",{"$f":"IF(U21<>\"\", U21*$G$2*Tables!$B$1,\"\")","v":""},null,"",{"$f":"IF($E21<>\"\",VLOOKUP(Input!$X21,Tables!$E$5:$G$200,2,FALSE), \"\")","v":""},{"$f":"IF($F21=\"\",\"\", VLOOKUP(Input!$X21,Tables!$E$5:$G$200,3,FALSE))","v":""},"","",null,null,"",null,{"$f":"IF($E21<>\"\",VLOOKUP(Input!J21,Tables!$L$5:$M$9,2,FALSE), \"\")","v":""},null,"",null,"",{"$f":"IF($N21<>\"\",VLOOKUP(Input!$AK21,Tables!$E$5:$G$200,2,FALSE), \"\")","v":""},{"$f":"IF($O21=\"\",\"\",VLOOKUP(Input!$AK21,Tables!$E$5:$G$200,3,FALSE))","v":""},"","","","","",null,{"$f":"IF($O21<>\"\",VLOOKUP(Input!S21,Tables!$L$5:$M$9,2,FALSE), \"\")","v":""},null,"","","",null,null,null,null,null,null,null,null,null,null,null,null,"00:00:00",{"$f":"MIN(AC21,AD21)/Tables!B$3","v":0},{"$f":"(((DATE(YEAR(BK21)+Tables!$B$3,MONTH(BK21),DAY(BK21))-BK21)*BL21))","v":0},"00:00:00","00:00:00","00:00:00",0,"2012-01-01",0,{"$f":"1","v":1},0,-40909,null,null,null,null,null,null,null,null,"",""]
[null,null,null,null,null,null,null,null,null,null,null,null,null,null,null,null,null,null,null,null,"",{"$f":"IF(U22<>\"\", U22*$G$2*Tables!$B$1,\"\")","v":""},null,"",{"$f":"IF($E22<>\"\",VLOOKUP(Input!$X22,Tables!$E$5:$G$200,2,FALSE), \"\")","v":""},{"$f":"IF($F22=\"\",\"\", VLOOKUP(Input!$X22,Tables!$E$5:$G$200,3,FALSE))","v":""},"","",null,null,"",null,{"$f":"IF($E22<>\"\",VLOOKUP(Input!J22,Tables!$L$5:$M$9,2,FALSE), \"\")","v":""},null,"",null,"",{"$f":"IF($N22<>\"\",VLOOKUP(Input!$AK22,Tables!$E$5:$G$200,2,FALSE), \"\")","v":""},{"$f":"IF($O22=\"\",\"\",VLOOKUP(Input!$AK22,Tables!$E$5:$G$200,3,FALSE))","v":""},"","","","","",null,{"$f":"IF($O22<>\"\",VLOOKUP(Input!S22,Tables!$L$5:$M$9,2,FALSE), \"\")","v":""},null,"","","",null,null,null,null,null,null,null,null,null,null,null,null,"00:00:00",{"$f":"MIN(AC22,AD22)/Tables!B$3","v":0},{"$f":"(((DATE(YEAR(BK22)+Tables!$B$3,MONTH(BK22),DAY(BK22))-BK22)*BL22))","v":0},"00:00:00","00:00:00","00:00:00",0,"2012-01-01",0,{"$f":"1","v":1},0,-40909,null,null,null,null,null,null,null,null,"",""]
[null,null,null,null,null,null,null,null,null,null,null,null,null,null,null,null,null,null,null,null,"",{"$f":"IF(U23<>\"\", U23*$G$2*Tables!$B$1,\"\")","v":""},null,"",{"$f":"IF($E23<>\"\",VLOOKUP(Input!$X23,Tables!$E$5:$G$200,2,FALSE), \"\")","v":""},{"$f":"IF($F23=\"\",\"\", VLOOKUP(Input!$X23,Tables!$E$5:$G$200,3,FALSE))","v":""},"","",null,null,"",null,{"$f":"IF($E23<>\"\",VLOOKUP(Input!J23,Tables!$L$5:$M$9,2,FALSE), \"\")","v":""},null,"",null,"",{"$f":"IF($N23<>\"\",VLOOKUP(Input!$AK23,Tables!$E$5:$G$200,2,FALSE), \"\")","v":""},{"$f":"IF($O23=\"\",\"\",VLOOKUP(Input!$AK23,Tables!$E$5:$G$200,3,FALSE))","v":""},"","","","","",null,{"$f":"IF($O23<>\"\",VLOOKUP(Input!S23,Tables!$L$5:$M$9,2,FALSE), \"\")","v":""},null,"","","",null,null,null,null,null,null,null,null,null,null,null,null,"00:00:00",{"$f":"MIN(AC23,AD23)/Tables!B$3","v":0},{"$f":"(((DATE(YEAR(BK23)+Tables!$B$3,MONTH(BK23),DAY(BK23))-BK23)*BL23))","v":0},"00:00:00","00:00:00","00:00:00",0,"2012-01-01",0,{"$f":"1","v":1},0,-40909,null,null,null,null,null,null,null,null,"",""]
[null,null,null,null,null,null,null,null,null,null,null,null,null,null,null,null,null,null,null,null,"",{"$f":"IF(U24<>\"\", U24*$G$2*Tables!$B$1,\"\")","v":""},null,"",{"$f":"IF($E24<>\"\",VLOOKUP(Input!$X24,Tables!$E$5:$G$200,2,FALSE), \"\")","v":""},{"$f":"IF($F24=\"\",\"\", VLOOKUP(Input!$X24,Tables!$E$5:$G$200,3,FALSE))","v":""},"","",null,null,"",null,{"$f":"IF($E24<>\"\",VLOOKUP(Input!J24,Tables!$L$5:$M$9,2,FALSE), \"\")","v":""},null,"",null,"",{"$f":"IF($N24<>\"\",VLOOKUP(Input!$AK24,Tables!$E$5:$G$200,2,FALSE), \"\")","v":""},{"$f":"IF($O24=\"\",\"\",VLOOKUP(Input!$AK24,Tables!$E$5:$G$200,3,FALSE))","v":""},"","","","","",null,{"$f":"IF($O24<>\"\",VLOOKUP(Input!S24,Tables!$L$5:$M$9,2,FALSE), \"\")","v":""},null,"","","",null,null,null,null,null,null,null,null,null,null,null,null,"00:00:00",{"$f":"MIN(AC24,AD24)/Tables!B$3","v":0},{"$f":"(((DATE(YEAR(BK24)+Tables!$B$3,MONTH(BK24),DAY(BK24))-BK24)*BL24))","v":0},"00:00:00","00:00:00","00:00:00",0,"2012-01-01",0,{"$f":"1","v":1},0,-40909,null,null,null,null,null,null,null,null,"",""]
[null,null,null,null,null,null,null,null,null,null,null,null,null,null,null,null,null,null,null,null,"",{"$f":"IF(U25<>\"\", U25*$G$2*Tables!$B$1,\"\")","v":""},null,"",{"$f":"IF($E25<>\"\",VLOOKUP(Input!$X25,Tables!$E$5:$G$200,2,FALSE), \"\")","v":""},{"$f":"IF($F25=\"\",\"\", VLOOKUP(Input!$X25,Tables!$E$5:$G$200,3,FALSE))","v":""},"","",null,null,"",null,{"$f":"IF($E25<>\"\",VLOOKUP(Input!J25,Tables!$L$5:$M$9,2,FALSE), \"\")","v":""},null,"",null,"",{"$f":"IF($N25<>\"\",VLOOKUP(Input!$AK25,Tables!$E$5:$G$200,2,FALSE), \"\")","v":""},{"$f":"IF($O25=\"\",\"\",VLOOKUP(Input!$AK25,Tables!$E$5:$G$200,3,FALSE))","v":""},"","","","","",null,{"$f":"IF($O25<>\"\",VLOOKUP(Input!S25,Tables!$L$5:$M$9,2,FALSE), \"\")","v":""},null,"","","",null,null,null,null,null,null,null,null,null,null,null,null,"00:00:00",{"$f":"MIN(AC25,AD25)/Tables!B$3","v":0},{"$f":"(((DATE(YEAR(BK25)+Tables!$B$3,MONTH(BK25),DAY(BK25))-BK25)*BL25))","v":0},"00:00:00","00:00:00","00:00:00",0,"2012-01-01",0,{"$f":"1","v":1},0,-40909,null,null,null,null,null,null,null,null,"",""]
[null,null,null,null,null,null,null,null,null,null,null,null,null,null,null,null,null,null,null,null,"",{"$f":"IF(U26<>\"\", U26*$G$2*Tables!$B$1,\"\")","v":""},null,"",{"$f":"IF($E26<>\"\",VLOOKUP(Input!$X26,Tables!$E$5:$G$200,2,FALSE), \"\")","v":""},{"$f":"IF($F26=\"\",\"\", VLOOKUP(Input!$X26,Tables!$E$5:$G$200,3,FALSE))","v":""},"","",null,null,"",null,{"$f":"IF($E26<>\"\",VLOOKUP(Input!J26,Tables!$L$5:$M$9,2,FALSE), \"\")","v":""},null,"",null,"",{"$f":"IF($N26<>\"\",VLOOKUP(Input!$AK26,Tables!$E$5:$G$200,2,FALSE), \"\")","v":""},{"$f":"IF($O26=\"\",\"\",VLOOKUP(Input!$AK26,Tables!$E$5:$G$200,3,FALSE))","v":""},"","","","","",null,{"$f":"IF($O26<>\"\",VLOOKUP(Input!S26,Tables!$L$5:$M$9,2,FALSE), \"\")","v":""},null,"","","",null,null,null,null,null,null,null,null,null,null,null,null,"00:00:00",{"$f":"MIN(AC26,AD26)/Tables!B$3","v":0},{"$f":"(((DATE(YEAR(BK26)+Tables!$B$3,MONTH(BK26),DAY(BK26))-BK26)*BL26))","v":0},"00:00:00","00:00:00","00:00:00",0,"2012-01-01",0,{"$f":"1","v":1},0,-40909,null,null,null,null,null,null,null,null,"",""]
[null,null,null,null,null,null,null,null,null,null,null,null,null,null,null,null,null,null,null,null,"",{"$f":"IF(U27<>\"\", U27*$G$2*Tables!$B$1,\"\")","v":""},null,"",{"$f":"IF($E27<>\"\",VLOOKUP(Input!$X27,Tables!$E$5:$G$200,2,FALSE), \"\")","v":""},{"$f":"IF($F27=\"\",\"\", VLOOKUP(Input!$X27,Tables!$E$5:$G$200,3,FALSE))","v":""},"","",null,null,"",null,{"$f":"IF($E27<>\"\",VLOOKUP(Input!J27,Tables!$L$5:$M$9,2,FALSE), \"\")","v":""},null,"",null,"",{"$f":"IF($N27<>\"\",VLOOKUP(Input!$AK27,Tables!$E$5:$G$200,2,FALSE), \"\")","v":""},{"$f":"IF($O27=\"\",\"\",VLOOKUP(Input!$AK27,Tables!$E$5:$G$200,3,FALSE))","v":""},"","","","","",null,{"$f":"IF($O27<>\"\",VLOOKUP(Input!S27,Tables!$L$5:$M$9,2,FALSE), \"\")","v":""},null,"","","",null,null,null,null,null,null,null,null,null,null,null,null,"00:00:00",{"$f":"MIN(AC27,AD27)/Tables!B$3","v":0},{"$f":"(((DATE(YEAR(BK27)+Tables!$B$3,MONTH(BK27),DAY(BK27))-BK27)*BL27))","v":0},"00:00:00","00:00:00","00:00:00",0,"2012-01-01",0,{"$f":"1","v":1},0,-40909,null,null,null,null,null,null,null,null,"",""]
[null,null,null,null,null,null,null,null,null,null,null,null,null,null,null,null,null,null,null,null,"",{"$f":"IF(U28<>\"\", U28*$G$2*Tables!$B$1,\"\")","v":""},null,"",{"$f":"IF($E28<>\"\",VLOOKUP(Input!$X28,Tables!$E$5:$G$200,2,FALSE), \"\")","v":""},{"$f":"IF($F28=\"\",\"\", VLOOKUP(Input!$X28,Tables!$E$5:$G$200,3,FALSE))","v":""},"","",null,null,"",null,{"$f":"IF($E28<>\"\",VLOOKUP(Input!J28,Tables!$L$5:$M$9,2,FALSE), \"\")","v":""},null,"",null,"",{"$f":"IF($N28<>\"\",VLOOKUP(Input!$AK28,Tables!$E$5:$G$200,2,FALSE), \"\")","v":""},{"$f":"IF($O28=\"\",\"\",VLOOKUP(Input!$AK28,Tables!$E$5:$G$200,3,FALSE))","v":""},"","","","","",null,{"$f":"IF($O28<>\"\",VLOOKUP(Input!S28,Tables!$L$5:$M$9,2,FALSE), \"\")","v":""},null,"","","",null,null,null,null,null,null,null,null,null,null,null,null,"00:00:00",{"$f":"MIN(AC28,AD28)/Tables!B$3","v":0},{"$f":"(((DATE(YEAR(BK28)+Tables!$B$3,MONTH(BK28),DAY(BK28))-BK28)*BL28))","v":0},"00:00:00","00:00:00","00:00:00",0,"2012-01-01",0,{"$f":"1","v":1},0,-40909,null,null,null,null,null,null,null,null,"",""]
[null,null,null,null,null,null,null,null,null,null,null,null,null,null,null,null,null,null,null,null,"",{"$f":"IF(U29<>\"\", U29*$G$2*Tables!$B$1,\"\")","v":""},null,"",{"$f":"IF($E29<>\"\",VLOOKUP(Input!$X29,Tables!$E$5:$G$200,2,FALSE), \"\")","v":""},{"$f":"IF($F29=\"\",\"\", VLOOKUP(Input!$X29,Tables!$E$5:$G$200,3,FALSE))","v":""},"","",null,null,"",null,{"$f":"IF($E29<>\"\",VLOOKUP(Input!J29,Tables!$L$5:$M$9,2,FALSE), \"\")","v":""},null,"",null,"",{"$f":"IF($N29<>\"\",VLOOKUP(Input!$AK29,Tables!$E$5:$G$200,2,FALSE), \"\")","v":""},{"$f":"IF($O29=\"\",\"\",VLOOKUP(Input!$AK29,Tables!$E$5:$G$200,3,FALSE))","v":""},"","","","","",null,{"$f":"IF($O29<>\"\",VLOOKUP(Input!S29,Tables!$L$5:$M$9,2,FALSE), \"\")","v":""},null,"","","",null,null,null,null,null,null,null,null,null,null,null,null,"00:00:00",{"$f":"MIN(AC29,AD29)/Tables!B$3","v":0},{"$f":"(((DATE(YEAR(BK29)+Tables!$B$3,MONTH(BK29),DAY(BK29))-BK29)*BL29))","v":0},"00:00:00","00:00:00","00:00:00",0,"2012-01-01",0,{"$f":"1","v":1},0,-40909,null,null,null,null,null,null,null,null,"",""]
[null,null,null,null,null,null,null,null,null,null,null,null,null,null,null,null,null,null,null,null,"",{"$f":"IF(U30<>\"\", U30*$G$2*Tables!$B$1,\"\")","v":""},null,"",{"$f":"IF($E30<>\"\",VLOOKUP(Input!$X30,Tables!$E$5:$G$200,2,FALSE), \"\")","v":""},{"$f":"IF($F30=\"\",\"\", VLOOKUP(Input!$X30,Tables!$E$5:$G$200,3,FALSE))","v":""},"","",null,null,"",null,{"$f":"IF($E30<>\"\",VLOOKUP(Input!J30,Tables!$L$5:$M$9,2,FALSE), \"\")","v":""},null,"",null,"",{"$f":"IF($N30<>\"\",VLOOKUP(Input!$AK30,Tables!$E$5:$G$200,2,FALSE), \"\")","v":""},{"$f":"IF($O30=\"\",\"\",VLOOKUP(Input!$AK30,Tables!$E$5:$G$200,3,FALSE))","v":""},"","","","","",null,{"$f":"IF($O30<>\"\",VLOOKUP(Input!S30,Tables!$L$5:$M$9,2,FALSE), \"\")","v":""},null,"","","",null,null,null,null,null,null,null,null,null,null,null,null,"00:00:00",{"$f":"MIN(AC30,AD30)/Tables!B$3","v":0},{"$f":"(((DATE(YEAR(BK30)+Tables!$B$3,MONTH(BK30),DAY(BK30))-BK30)*BL30))","v":0},"00:00:00","00:00:00","00:00:00",0,"2012-01-01",0,{"$f":"1","v":1},0,-40909,null,null,null,null,null,null,null,null,"",""]
[null,null,null,null,null,null,null,null,null,null,null,null,null,null,null,null,null,null,null,null,"",{"$f":"IF(U31<>\"\", U31*$G$2*Tables!$B$1,\"\")","v":""},null,"",{"$f":"IF($E31<>\"\",VLOOKUP(Input!$X31,Tables!$E$5:$G$200,2,FALSE), \"\")","v":""},{"$f":"IF($F31=\"\",\"\", VLOOKUP(Input!$X31,Tables!$E$5:$G$200,3,FALSE))","v":""},"","",null,null,"",null,{"$f":"IF($E31<>\"\",VLOOKUP(Input!J31,Tables!$L$5:$M$9,2,FALSE), \"\")","v":""},null,"",null,"",{"$f":"IF($N31<>\"\",VLOOKUP(Input!$AK31,Tables!$E$5:$G$200,2,FALSE), \"\")","v":""},{"$f":"IF($O31=\"\",\"\",VLOOKUP(Input!$AK31,Tables!$E$5:$G$200,3,FALSE))","v":""},"","","","","",null,{"$f":"IF($O31<>\"\",VLOOKUP(Input!S31,Tables!$L$5:$M$9,2,FALSE), \"\")","v":""},null,"","","",null,null,null,null,null,null,null,null,null,null,null,null,"00:00:00",{"$f":"MIN(AC31,AD31)/Tables!B$3","v":0},{"$f":"(((DATE(YEAR(BK31)+Tables!$B$3,MONTH(BK31),DAY(BK31))-BK31)*BL31))","v":0},"00:00:00","00:00:00","00:00:00",0,"2012-01-01",0,{"$f":"1","v":1},0,-40909,null,null,null,null,null,null,null,null,"",""]
[null,null,null,null,null,null,null,null,null,null,null,null,null,null,null,null,null,null,null,null,"",{"$f":"IF(U32<>\"\", U32*$G$2*Tables!$B$1,\"\")","v":""},null,"",{"$f":"IF($E32<>\"\",VLOOKUP(Input!$X32,Tables!$E$5:$G$200,2,FALSE), \"\")","v":""},{"$f":"IF($F32=\"\",\"\", VLOOKUP(Input!$X32,Tables!$E$5:$G$200,3,FALSE))","v":""},"","",null,null,"",null,{"$f":"IF($E32<>\"\",VLOOKUP(Input!J32,Tables!$L$5:$M$9,2,FALSE), \"\")","v":""},null,"",null,"",{"$f":"IF($N32<>\"\",VLOOKUP(Input!$AK32,Tables!$E$5:$G$200,2,FALSE), \"\")","v":""},{"$f":"IF($O32=\"\",\"\",VLOOKUP(Input!$AK32,Tables!$E$5:$G$200,3,FALSE))","v":""},"","","","","",null,{"$f":"IF($O32<>\"\",VLOOKUP(Input!S32,Tables!$L$5:$M$9,2,FALSE), \"\")","v":""},null,"","","",null,null,null,null,null,null,null,null,null,null,null,null,"00:00:00",{"$f":"MIN(AC32,AD32)/Tables!B$3","v":0},{"$f":"(((DATE(YEAR(BK32)+Tables!$B$3,MONTH(BK32),DAY(BK32))-BK32)*BL32))","v":0},"00:00:00","00:00:00","00:00:00",0,"2012-01-01",0,{"$f":"1","v":1},0,-40909,null,null,null,null,null,null,null,null,"",""]
[null,null,null,null,null,null,null,null,null,null,null,null,null,null,null,null,null,null,null,null,"",{"$f":"IF(U33<>\"\", U33*$G$2*Tables!$B$1,\"\")","v":""},null,"",{"$f":"IF($E33<>\"\",VLOOKUP(Input!$X33,Tables!$E$5:$G$200,2,FALSE), \"\")","v":""},{"$f":"IF($F33=\"\",\"\", VLOOKUP(Input!$X33,Tables!$E$5:$G$200,3,FALSE))","v":""},"","",null,null,"",null,{"$f":"IF($E33<>\"\",VLOOKUP(Input!J33,Tables!$L$5:$M$9,2,FALSE), \"\")","v":""},null,"",null,"",{"$f":"IF($N33<>\"\",VLOOKUP(Input!$AK33,Tables!$E$5:$G$200,2,FALSE), \"\")","v":""},{"$f":"IF($O33=\"\",\"\",VLOOKUP(Input!$AK33,Tables!$E$5:$G$200,3,FALSE))","v":""},"","","","","",null,{"$f":"IF($O33<>\"\",VLOOKUP(Input!S33,Tables!$L$5:$M$9,2,FALSE), \"\")","v":""},null,"","","",null,null,null,null,null,null,null,null,null,null,null,null,"00:00:00",{"$f":"MIN(AC33,AD33)/Tables!B$3","v":0},{"$f":"(((DATE(YEAR(BK33)+Tables!$B$3,MONTH(BK33),DAY(BK33))-BK33)*BL33))","v":0},"00:00:00","00:00:00","00:00:00",0,"2012-01-01",0,{"$f":"1","v":1},0,-40909,null,null,null,null,null,null,null,null,"",""]
[null,null,null,null,null,null,null,null,null,null,null,null,null,null,null,null,null,null,null,null,"",{"$f":"IF(U34<>\"\", U34*$G$2*Tables!$B$1,\"\")","v":""},null,"",{"$f":"IF($E34<>\"\",VLOOKUP(Input!$X34,Tables!$E$5:$G$200,2,FALSE), \"\")","v":""},{"$f":"IF($F34=\"\",\"\", VLOOKUP(Input!$X34,Tables!$E$5:$G$200,3,FALSE))","v":""},"","",null,null,"",null,{"$f":"IF($E34<>\"\",VLOOKUP(Input!J34,Tables!$L$5:$M$9,2,FALSE), \"\")","v":""},null,"",null,"",{"$f":"IF($N34<>\"\",VLOOKUP(Input!$AK34,Tables!$E$5:$G$200,2,FALSE), \"\")","v":""},{"$f":"IF($O34=\"\",\"\",VLOOKUP(Input!$AK34,Tables!$E$5:$G$200,3,FALSE))","v":""},"","","","","",null,{"$f":"IF($O34<>\"\",VLOOKUP(Input!S34,Tables!$L$5:$M$9,2,FALSE), \"\")","v":""},null,"","","",null,null,null,null,null,null,null,null,null,null,null,null,"00:00:00",{"$f":"MIN(AC34,AD34)/Tables!B$3","v":0},{"$f":"(((DATE(YEAR(BK34)+Tables!$B$3,MONTH(BK34),DAY(BK34))-BK34)*BL34))","v":0},"00:00:00","00:00:00","00:00:00",0,"2012-01-01",0,{"$f":"1","v":1},0,-40909,null,null,null,null,null,null,null,null,"",""]
[null,null,null,null,null,null,null,null,null,null,null,null,null,null,null,null,null,null,null,null,"",{"$f":"IF(U35<>\"\", U35*$G$2*Tables!$B$1,\"\")","v":""},null,"",{"$f":"IF($E35<>\"\",VLOOKUP(Input!$X35,Tables!$E$5:$G$200,2,FALSE), \"\")","v":""},{"$f":"IF($F35=\"\",\"\", VLOOKUP(Input!$X35,Tables!$E$5:$G$200,3,FALSE))","v":""},"","",null,null,"",null,{"$f":"IF($E35<>\"\",VLOOKUP(Input!J35,Tables!$L$5:$M$9,2,FALSE), \"\")","v":""},null,"",null,"",{"$f":"IF($N35<>\"\",VLOOKUP(Input!$AK35,Tables!$E$5:$G$200,2,FALSE), \"\")","v":""},{"$f":"IF($O35=\"\",\"\",VLOOKUP(Input!$AK35,Tables!$E$5:$G$200,3,FALSE))","v":""},"","","","","",null,{"$f":"IF($O35<>\"\",VLOOKUP(Input!S35,Tables!$L$5:$M$9,2,FALSE), \"\")","v":""},null,"","","",null,null,null,null,null,null,null,null,null,null,null,null,"00:00:00",{"$f":"MIN(AC35,AD35)/Tables!B$3","v":0},{"$f":"(((DATE(YEAR(BK35)+Tables!$B$3,MONTH(BK35),DAY(BK35))-BK35)*BL35))","v":0},"00:00:00","00:00:00","00:00:00",0,"2012-01-01",0,{"$f":"1","v":1},0,-40909,null,null,null,null,null,null,null,null,"",""]
[null,null,null,null,null,null,null,null,null,null,null,null,null,null,null,null,null,null,null,null,"",{"$f":"IF(U36<>\"\", U36*$G$2*Tables!$B$1,\"\")","v":""},null,"",{"$f":"IF($E36<>\"\",VLOOKUP(Input!$X36,Tables!$E$5:$G$200,2,FALSE), \"\")","v":""},{"$f":"IF($F36=\"\",\"\", VLOOKUP(Input!$X36,Tables!$E$5:$G$200,3,FALSE))","v":""},"","",null,null,"",null,{"$f":"IF($E36<>\"\",VLOOKUP(Input!J36,Tables!$L$5:$M$9,2,FALSE), \"\")","v":""},null,"",null,"",{"$f":"IF($N36<>\"\",VLOOKUP(Input!$AK36,Tables!$E$5:$G$200,2,FALSE), \"\")","v":""},{"$f":"IF($O36=\"\",\"\",VLOOKUP(Input!$AK36,Tables!$E$5:$G$200,3,FALSE))","v":""},"","","","","",null,{"$f":"IF($O36<>\"\",VLOOKUP(Input!S36,Tables!$L$5:$M$9,2,FALSE), \"\")","v":""},null,"","","",null,null,null,null,null,null,null,null,null,null,null,null,"00:00:00",{"$f":"MIN(AC36,AD36)/Tables!B$3","v":0},{"$f":"(((DATE(YEAR(BK36)+Tables!$B$3,MONTH(BK36),DAY(BK36))-BK36)*BL36))","v":0},"00:00:00","00:00:00","00:00:00",0,"2012-01-01",0,{"$f":"1","v":1},0,-40909,null,null,null,null,null,null,null,null,"",""]
[null,null,null,null,null,null,null,null,null,null,null,null,null,null,null,null,null,null,null,null,"",{"$f":"IF(U37<>\"\", U37*$G$2*Tables!$B$1,\"\")","v":""},null,"",{"$f":"IF($E37<>\"\",VLOOKUP(Input!$X37,Tables!$E$5:$G$200,2,FALSE), \"\")","v":""},{"$f":"IF($F37=\"\",\"\", VLOOKUP(Input!$X37,Tables!$E$5:$G$200,3,FALSE))","v":""},"","",null,null,"",null,{"$f":"IF($E37<>\"\",VLOOKUP(Input!J37,Tables!$L$5:$M$9,2,FALSE), \"\")","v":""},null,"",null,"",{"$f":"IF($N37<>\"\",VLOOKUP(Input!$AK37,Tables!$E$5:$G$200,2,FALSE), \"\")","v":""},{"$f":"IF($O37=\"\",\"\",VLOOKUP(Input!$AK37,Tables!$E$5:$G$200,3,FALSE))","v":""},"","","","","",null,{"$f":"IF($O37<>\"\",VLOOKUP(Input!S37,Tables!$L$5:$M$9,2,FALSE), \"\")","v":""},null,"","","",null,null,null,null,null,null,null,null,null,null,null,null,"00:00:00",{"$f":"MIN(AC37,AD37)/Tables!B$3","v":0},{"$f":"(((DATE(YEAR(BK37)+Tables!$B$3,MONTH(BK37),DAY(BK37))-BK37)*BL37))","v":0},"00:00:00","00:00:00","00:00:00",0,"2012-01-01",0,{"$f":"1","v":1},0,-40909,null,null,null,null,null,null,null,null,"",""]
[null,null,null,null,null,null,null,null,null,null,null,null,null,null,null,null,null,null,null,null,"",{"$f":"IF(U38<>\"\", U38*$G$2*Tables!$B$1,\"\")","v":""},null,"",{"$f":"IF($E38<>\"\",VLOOKUP(Input!$X38,Tables!$E$5:$G$200,2,FALSE), \"\")","v":""},{"$f":"IF($F38=\"\",\"\", VLOOKUP(Input!$X38,Tables!$E$5:$G$200,3,FALSE))","v":""},"","",null,null,"",null,{"$f":"IF($E38<>\"\",VLOOKUP(Input!J38,Tables!$L$5:$M$9,2,FALSE), \"\")","v":""},null,"",null,"",{"$f":"IF($N38<>\"\",VLOOKUP(Input!$AK38,Tables!$E$5:$G$200,2,FALSE), \"\")","v":""},{"$f":"IF($O38=\"\",\"\",VLOOKUP(Input!$AK38,Tables!$E$5:$G$200,3,FALSE))","v":""},"","","","","",null,{"$f":"IF($O38<>\"\",VLOOKUP(Input!S38,Tables!$L$5:$M$9,2,FALSE), \"\")","v":""},null,"","","",null,null,null,null,null,null,null,null,null,null,null,null,"00:00:00",{"$f":"MIN(AC38,AD38)/Tables!B$3","v":0},{"$f":"(((DATE(YEAR(BK38)+Tables!$B$3,MONTH(BK38),DAY(BK38))-BK38)*BL38))","v":0},"00:00:00","00:00:00","00:00:00",0,"2012-01-01",0,{"$f":"1","v":1},0,-40909,null,null,null,null,null,null,null,null,"",""]
[null,null,null,null,null,null,null,null,null,null,null,null,null,null,null,null,null,null,null,null,{"$f":"IF(AW39<>\"\",AW39, \"\")","v":""},{"$f":"IF(U39<>\"\", U39*$G$2*Tables!$B$1,\"\")","v":""},null,"",{"$f":"IF($E39<>\"\",VLOOKUP(Input!$X39,Tables!$E$5:$G$200,2,FALSE), \"\")","v":""},{"$f":"IF($F39=\"\",\"\", VLOOKUP(Input!$X39,Tables!$E$5:$G$200,3,FALSE))","v":""},{"$f":"IF($E39<>\"\",C39*(Y39*F39), \"\")","v":""},{"$f":"IF(X39<>\"\",C39*Z39,\"\")","v":""},null,null,"",null,{"$f":"IF($E39<>\"\",VLOOKUP(Input!J39,Tables!$L$5:$M$9,2,FALSE), \"\")","v":""},null,{"$f":"IF($E39<>\"\",((AA39*AC39+AB39*AD39)*AE39*AF39*AG39)/10^6, \"\")","v":""},null,"",{"$f":"IF($N39<>\"\",VLOOKUP(Input!$AK39,Tables!$E$5:$G$200,2,FALSE), \"\")","v":""},{"$f":"IF($O39=\"\",\"\",VLOOKUP(Input!$AK39,Tables!$E$5:$G$200,3,FALSE))","v":""},{"$f":"IF($E39<>\"\",L39*(AL39*O39), \"\")","v":""},{"$f":"IF(AK39<>\"\",AM39*L39,\"\")","v":""},"","","",null,{"$f":"IF($O39<>\"\",VLOOKUP(Input!S39,Tables!$L$5:$M$9,2,FALSE), \"\")","v":""},null,{"$f":"IF($E39<>\"\",(AN39*AP39+AO39*AQ39)*AR39*AS39*AT39/10^6, \"\")","v":""},{"$f":"IF($O39<>\"\",AI39-AV39,\"\")","v":""},{"$f":"IF($O39<>\"\",AW39*G$2,\"\")","v":""},null,null,null,null,null,null,null,null,null,null,null,null,"00:00:00",{"$f":"MIN(AC39,AD39)/Tables!B$3","v":0},{"$f":"(((DATE(YEAR(BK39)+Tables!$B$3,MONTH(BK39),DAY(BK39))-BK39)*BL39))","v":0},{"$f":"BK39+BM39","v":"00:00:00"},"00:00:00","00:00:00",{"$f":"BN39-BP39","v":0},"2012-01-01",{"$f":"IF((BN39-BR39)<0,0,(BN39-BR39))","v":0},{"$f":"1","v":1},0,-40909,null,null,null,null,null,null,null,null,"",""]
[null,null,null,null,null,null,null,null,null,null,null,null,null,null,null,null,null,null,null,null,"",{"$f":"IF(U40<>\"\", U40*$G$2*Tables!$B$1,\"\")","v":""},null,"",{"$f":"IF($E40<>\"\",VLOOKUP(Input!$X40,Tables!$E$5:$G$200,2,FALSE), \"\")","v":""},{"$f":"IF($F40=\"\",\"\", VLOOKUP(Input!$X40,Tables!$E$5:$G$200,3,FALSE))","v":""},"","",null,null,"",null,{"$f":"IF($E40<>\"\",VLOOKUP(Input!J40,Tables!$L$5:$M$9,2,FALSE), \"\")","v":""},null,"",null,"",{"$f":"IF($N40<>\"\",VLOOKUP(Input!$AK40,Tables!$E$5:$G$200,2,FALSE), \"\")","v":""},{"$f":"IF($O40=\"\",\"\",VLOOKUP(Input!$AK40,Tables!$E$5:$G$200,3,FALSE))","v":""},"","","","","",null,{"$f":"IF($O40<>\"\",VLOOKUP(Input!S40,Tables!$L$5:$M$9,2,FALSE), \"\")","v":""},null,"","","",null,null,null,null,null,null,null,null,null,null,null,null,"00:00:00",{"$f":"MIN(AC40,AD40)/Tables!B$3","v":0},{"$f":"(((DATE(YEAR(BK40)+Tables!$B$3,MONTH(BK40),DAY(BK40))-BK40)*BL40))","v":0},"00:00:00","00:00:00","00:00:00",0,"2012-01-01",0,{"$f":"1","v":1},0,-40909,null,null,null,null,null,null,null,null,"",""]
[null,null,null,null,null,null,null,null,null,null,null,null,null,null,null,null,null,null,null,null,"",{"$f":"IF(U41<>\"\", U41*$G$2*Tables!$B$1,\"\")","v":""},null,"",{"$f":"IF($E41<>\"\",VLOOKUP(Input!$X41,Tables!$E$5:$G$200,2,FALSE), \"\")","v":""},{"$f":"IF($F41=\"\",\"\", VLOOKUP(Input!$X41,Tables!$E$5:$G$200,3,FALSE))","v":""},"","",null,null,"",null,{"$f":"IF($E41<>\"\",VLOOKUP(Input!J41,Tables!$L$5:$M$9,2,FALSE), \"\")","v":""},null,"",null,"",{"$f":"IF($N41<>\"\",VLOOKUP(Input!$AK41,Tables!$E$5:$G$200,2,FALSE), \"\")","v":""},{"$f":"IF($O41=\"\",\"\",VLOOKUP(Input!$AK41,Tables!$E$5:$G$200,3,FALSE))","v":""},"","","","","",null,{"$f":"IF($O41<>\"\",VLOOKUP(Input!S41,Tables!$L$5:$M$9,2,FALSE), \"\")","v":""},null,"","","",null,null,null,null,null,null,null,null,null,null,null,null,"00:00:00",{"$f":"MIN(AC41,AD41)/Tables!B$3","v":0},{"$f":"(((DATE(YEAR(BK41)+Tables!$B$3,MONTH(BK41),DAY(BK41))-BK41)*BL41))","v":0},"00:00:00","00:00:00","00:00:00",0,"2012-01-01",0,{"$f":"1","v":1},0,-40909,null,null,null,null,null,null,null,null,"",""]
[null,null,null,null,null,null,null,null,null,null,null,null,null,null,null,null,null,null,null,null,"",{"$f":"IF(U42<>\"\", U42*$G$2*Tables!$B$1,\"\")","v":""},null,"",{"$f":"IF($E42<>\"\",VLOOKUP(Input!$X42,Tables!$E$5:$G$200,2,FALSE), \"\")","v":""},{"$f":"IF($F42=\"\",\"\", VLOOKUP(Input!$X42,Tables!$E$5:$G$200,3,FALSE))","v":""},"","",null,null,"",null,{"$f":"IF($E42<>\"\",VLOOKUP(Input!J42,Tables!$L$5:$M$9,2,FALSE), \"\")","v":""},null,"",null,"",{"$f":"IF($N42<>\"\",VLOOKUP(Input!$AK42,Tables!$E$5:$G$200,2,FALSE), \"\")","v":""},{"$f":"IF($O42=\"\",\"\",VLOOKUP(Input!$AK42,Tables!$E$5:$G$200,3,FALSE))","v":""},"","","","","",null,{"$f":"IF($O42<>\"\",VLOOKUP(Input!S42,Tables!$L$5:$M$9,2,FALSE), \"\")","v":""},null,"","","",null,null,null,null,null,null,null,null,null,null,null,null,"00:00:00",{"$f":"MIN(AC42,AD42)/Tables!B$3","v":0},{"$f":"(((DATE(YEAR(BK42)+Tables!$B$3,MONTH(BK42),DAY(BK42))-BK42)*BL42))","v":0},"00:00:00","00:00:00","00:00:00",0,"2012-01-01",0,{"$f":"1","v":1},0,-40909,null,null,null,null,null,null,null,null,"",""]
[null,null,null,null,null,null,null,null,null,null,null,null,null,null,null,null,null,null,null,null,"",{"$f":"IF(U43<>\"\", U43*$G$2*Tables!$B$1,\"\")","v":""},null,"",{"$f":"IF($E43<>\"\",VLOOKUP(Input!$X43,Tables!$E$5:$G$200,2,FALSE), \"\")","v":""},{"$f":"IF($F43=\"\",\"\", VLOOKUP(Input!$X43,Tables!$E$5:$G$200,3,FALSE))","v":""},"","",null,null,"",null,{"$f":"IF($E43<>\"\",VLOOKUP(Input!J43,Tables!$L$5:$M$9,2,FALSE), \"\")","v":""},null,"",null,"",{"$f":"IF($N43<>\"\",VLOOKUP(Input!$AK43,Tables!$E$5:$G$200,2,FALSE), \"\")","v":""},{"$f":"IF($O43=\"\",\"\",VLOOKUP(Input!$AK43,Tables!$E$5:$G$200,3,FALSE))","v":""},"","","","","",null,{"$f":"IF($O43<>\"\",VLOOKUP(Input!S43,Tables!$L$5:$M$9,2,FALSE), \"\")","v":""},null,"","","",null,null,null,null,null,null,null,null,null,null,null,null,"00:00:00",{"$f":"MIN(AC43,AD43)/Tables!B$3","v":0},{"$f":"(((DATE(YEAR(BK43)+Tables!$B$3,MONTH(BK43),DAY(BK43))-BK43)*BL43))","v":0},"00:00:00","00:00:00","00:00:00",0,"2012-01-01",0,{"$f":"1","v":1},0,-40909,null,null,null,null,null,null,null,null,"",""]
[null,null,null,null,null,null,null,null,null,null,null,null,null,null,null,null,null,null,null,null,"",{"$f":"IF(U44<>\"\", U44*$G$2*Tables!$B$1,\"\")","v":""},null,"",{"$f":"IF($E44<>\"\",VLOOKUP(Input!$X44,Tables!$E$5:$G$200,2,FALSE), \"\")","v":""},{"$f":"IF($F44=\"\",\"\", VLOOKUP(Input!$X44,Tables!$E$5:$G$200,3,FALSE))","v":""},"","",null,null,"",null,{"$f":"IF($E44<>\"\",VLOOKUP(Input!J44,Tables!$L$5:$M$9,2,FALSE), \"\")","v":""},null,"",null,"",{"$f":"IF($N44<>\"\",VLOOKUP(Input!$AK44,Tables!$E$5:$G$200,2,FALSE), \"\")","v":""},{"$f":"IF($O44=\"\",\"\",VLOOKUP(Input!$AK44,Tables!$E$5:$G$200,3,FALSE))","v":""},"","","","","",null,{"$f":"IF($O44<>\"\",VLOOKUP(Input!S44,Tables!$L$5:$M$9,2,FALSE), \"\")","v":""},null,"","","",null,null,null,null,null,null,null,null,null,null,null,null,"00:00:00",{"$f":"MIN(AC44,AD44)/Tables!B$3","v":0},{"$f":"(((DATE(YEAR(BK44)+Tables!$B$3,MONTH(BK44),DAY(BK44))-BK44)*BL44))","v":0},"00:00:00","00:00:00","00:00:00",0,"2012-01-01",0,{"$f":"1","v":1},0,-40909,null,null,null,null,null,null,null,null,"",""]
[null,null,null,null,null,null,null,null,null,null,null,null,null,null,null,null,null,null,null,null,"",{"$f":"IF(U45<>\"\", U45*$G$2*Tables!$B$1,\"\")","v":""},null,"",{"$f":"IF($E45<>\"\",VLOOKUP(Input!$X45,Tables!$E$5:$G$200,2,FALSE), \"\")","v":""},{"$f":"IF($F45=\"\",\"\", VLOOKUP(Input!$X45,Tables!$E$5:$G$200,3,FALSE))","v":""},"","",null,null,"",null,{"$f":"IF($E45<>\"\",VLOOKUP(Input!J45,Tables!$L$5:$M$9,2,FALSE), \"\")","v":""},null,"",null,"",{"$f":"IF($N45<>\"\",VLOOKUP(Input!$AK45,Tables!$E$5:$G$200,2,FALSE), \"\")","v":""},{"$f":"IF($O45=\"\",\"\",VLOOKUP(Input!$AK45,Tables!$E$5:$G$200,3,FALSE))","v":""},"","","","","",null,{"$f":"IF($O45<>\"\",VLOOKUP(Input!S45,Tables!$L$5:$M$9,2,FALSE), \"\")","v":""},null,"","","",null,null,null,null,null,null,null,null,null,null,null,null,"00:00:00",{"$f":"MIN(AC45,AD45)/Tables!B$3","v":0},{"$f":"(((DATE(YEAR(BK45)+Tables!$B$3,MONTH(BK45),DAY(BK45))-BK45)*BL45))","v":0},"00:00:00","00:00:00","00:00:00",0,"2012-01-01",0,{"$f":"1","v":1},0,-40909,null,null,null,null,null,null,null,null,"",""]
[null,null,null,null,null,null,null,null,null,null,null,null,null,null,null,null,null,null,null,null,"",{"$f":"IF(U46<>\"\", U46*$G$2*Tables!$B$1,\"\")","v":""},null,"",{"$f":"IF($E46<>\"\",VLOOKUP(Input!$X46,Tables!$E$5:$G$200,2,FALSE), \"\")","v":""},{"$f":"IF($F46=\"\",\"\", VLOOKUP(Input!$X46,Tables!$E$5:$G$200,3,FALSE))","v":""},"","",null,null,"",null,{"$f":"IF($E46<>\"\",VLOOKUP(Input!J46,Tables!$L$5:$M$9,2,FALSE), \"\")","v":""},null,"",null,"",{"$f":"IF($N46<>\"\",VLOOKUP(Input!$AK46,Tables!$E$5:$G$200,2,FALSE), \"\")","v":""},{"$f":"IF($O46=\"\",\"\",VLOOKUP(Input!$AK46,Tables!$E$5:$G$200,3,FALSE))","v":""},"","","","","",null,{"$f":"IF($O46<>\"\",VLOOKUP(Input!S46,Tables!$L$5:$M$9,2,FALSE), \"\")","v":""},null,"","","",null,null,null,null,null,null,null,null,null,null,null,null,"00:00:00",{"$f":"MIN(AC46,AD46)/Tables!B$3","v":0},{"$f":"(((DATE(YEAR(BK46)+Tables!$B$3,MONTH(BK46),DAY(BK46))-BK46)*BL46))","v":0},"00:00:00","00:00:00","00:00:00",0,"2012-01-01",0,{"$f":"1","v":1},0,-40909,null,null,null,null,null,null,null,null,"",""]
[null,null,null,null,null,null,null,null,null,null,null,null,null,null,null,null,null,null,null,null,"",{"$f":"IF(U47<>\"\", U47*$G$2*Tables!$B$1,\"\")","v":""},null,"",{"$f":"IF($E47<>\"\",VLOOKUP(Input!$X47,Tables!$E$5:$G$200,2,FALSE), \"\")","v":""},{"$f":"IF($F47=\"\",\"\", VLOOKUP(Input!$X47,Tables!$E$5:$G$200,3,FALSE))","v":""},"","",null,null,"",null,{"$f":"IF($E47<>\"\",VLOOKUP(Input!J47,Tables!$L$5:$M$9,2,FALSE), \"\")","v":""},null,"",null,"",{"$f":"IF($N47<>\"\",VLOOKUP(Input!$AK47,Tables!$E$5:$G$200,2,FALSE), \"\")","v":""},{"$f":"IF($O47=\"\",\"\",VLOOKUP(Input!$AK47,Tables!$E$5:$G$200,3,FALSE))","v":""},"","","","","",null,{"$f":"IF($O47<>\"\",VLOOKUP(Input!S47,Tables!$L$5:$M$9,2,FALSE), \"\")","v":""},null,"","","",null,null,null,null,null,null,null,null,null,null,null,null,"00:00:00",{"$f":"MIN(AC47,AD47)/Tables!B$3","v":0},{"$f":"(((DATE(YEAR(BK47)+Tables!$B$3,MONTH(BK47),DAY(BK47))-BK47)*BL47))","v":0},"00:00:00","00:00:00","00:00:00",0,"2012-01-01",0,{"$f":"1","v":1},0,-40909,null,null,null,null,null,null,null,null,"",""]
[null,null,null,null,null,null,null,null,null,null,null,null,null,null,null,null,null,null,null,null,"",{"$f":"IF(U48<>\"\", U48*$G$2*Tables!$B$1,\"\")","v":""},null,"",{"$f":"IF($E48<>\"\",VLOOKUP(Input!$X48,Tables!$E$5:$G$200,2,FALSE), \"\")","v":""},{"$f":"IF($F48=\"\",\"\", VLOOKUP(Input!$X48,Tables!$E$5:$G$200,3,FALSE))","v":""},"","",null,null,"",null,{"$f":"IF($E48<>\"\",VLOOKUP(Input!J48,Tables!$L$5:$M$9,2,FALSE), \"\")","v":""},null,"",null,"",{"$f":"IF($N48<>\"\",VLOOKUP(Input!$AK48,Tables!$E$5:$G$200,2,FALSE), \"\")","v":""},{"$f":"IF($O48=\"\",\"\",VLOOKUP(Input!$AK48,Tables!$E$5:$G$200,3,FALSE))","v":""},"","","","","",null,{"$f":"IF($O48<>\"\",VLOOKUP(Input!S48,Tables!$L$5:$M$9,2,FALSE), \"\")","v":""},null,"","","",null,null,null,null,null,null,null,null,null,null,null,null,"00:00:00",{"$f":"MIN(AC48,AD48)/Tables!B$3","v":0},{"$f":"(((DATE(YEAR(BK48)+Tables!$B$3,MONTH(BK48),DAY(BK48))-BK48)*BL48))","v":0},"00:00:00","00:00:00","00:00:00",0,"2012-01-01",0,{"$f":"1","v":1},0,-40909,null,null,null,null,null,null,null,null,"",""]
[null,null,null,null,null,null,null,null,null,null,null,null,null,null,null,null,null,null,null,null,"",{"$f":"IF(U49<>\"\", U49*$G$2*Tables!$B$1,\"\")","v":""},null,"",{"$f":"IF($E49<>\"\",VLOOKUP(Input!$X49,Tables!$E$5:$G$200,2,FALSE), \"\")","v":""},{"$f":"IF($F49=\"\",\"\", VLOOKUP(Input!$X49,Tables!$E$5:$G$200,3,FALSE))","v":""},"","",null,null,"",null,{"$f":"IF($E49<>\"\",VLOOKUP(Input!J49,Tables!$L$5:$M$9,2,FALSE), \"\")","v":""},null,"",null,"",{"$f":"IF($N49<>\"\",VLOOKUP(Input!$AK49,Tables!$E$5:$G$200,2,FALSE), \"\")","v":""},{"$f":"IF($O49=\"\",\"\",VLOOKUP(Input!$AK49,Tables!$E$5:$G$200,3,FALSE))","v":""},"","","","","",null,{"$f":"IF($O49<>\"\",VLOOKUP(Input!S49,Tables!$L$5:$M$9,2,FALSE), \"\")","v":""},null,"","","",null,null,null,null,null,null,null,null,null,null,null,null,"00:00:00",{"$f":"MIN(AC49,AD49)/Tables!B$3","v":0},{"$f":"(((DATE(YEAR(BK49)+Tables!$B$3,MONTH(BK49),DAY(BK49))-BK49)*BL49))","v":0},"00:00:00","00:00:00","00:00:00",0,"2012-01-01",0,{"$f":"1","v":1},0,-40909,null,null,null,null,null,null,null,null,"",""]
[null,null,null,null,null,null,null,null,null,null,null,null,null,null,null,null,null,null,null,null,"",{"$f":"IF(U50<>\"\", U50*$G$2*Tables!$B$1,\"\")","v":""},null,"",{"$f":"IF($E50<>\"\",VLOOKUP(Input!$X50,Tables!$E$5:$G$200,2,FALSE), \"\")","v":""},{"$f":"IF($F50=\"\",\"\", VLOOKUP(Input!$X50,Tables!$E$5:$G$200,3,FALSE))","v":""},"","",null,null,"",null,{"$f":"IF($E50<>\"\",VLOOKUP(Input!J50,Tables!$L$5:$M$9,2,FALSE), \"\")","v":""},null,"",null,"",{"$f":"IF($N50<>\"\",VLOOKUP(Input!$AK50,Tables!$E$5:$G$200,2,FALSE), \"\")","v":""},{"$f":"IF($O50=\"\",\"\",VLOOKUP(Input!$AK50,Tables!$E$5:$G$200,3,FALSE))","v":""},"","","","","",null,{"$f":"IF($O50<>\"\",VLOOKUP(Input!S50,Tables!$L$5:$M$9,2,FALSE), \"\")","v":""},null,"","","",null,null,null,null,null,null,null,null,null,null,null,null,"00:00:00",{"$f":"MIN(AC50,AD50)/Tables!B$3","v":0},{"$f":"(((DATE(YEAR(BK50)+Tables!$B$3,MONTH(BK50),DAY(BK50))-BK50)*BL50))","v":0},"00:00:00","00:00:00","00:00:00",0,"2012-01-01",0,{"$f":"1","v":1},0,-40909,null,null,null,null,null,null,null,null,"",""]
[null,null,null,null,null,null,null,null,null,null,null,null,null,null,null,null,null,null,null,null,"",{"$f":"IF(U51<>\"\", U51*$G$2*Tables!$B$1,\"\")","v":""},null,"",{"$f":"IF($E51<>\"\",VLOOKUP(Input!$X51,Tables!$E$5:$G$200,2,FALSE), \"\")","v":""},{"$f":"IF($F51=\"\",\"\", VLOOKUP(Input!$X51,Tables!$E$5:$G$200,3,FALSE))","v":""},"","",null,null,"",null,{"$f":"IF($E51<>\"\",VLOOKUP(Input!J51,Tables!$L$5:$M$9,2,FALSE), \"\")","v":""},null,"",null,"",{"$f":"IF($N51<>\"\",VLOOKUP(Input!$AK51,Tables!$E$5:$G$200,2,FALSE), \"\")","v":""},{"$f":"IF($O51=\"\",\"\",VLOOKUP(Input!$AK51,Tables!$E$5:$G$200,3,FALSE))","v":""},"","","","","",null,{"$f":"IF($O51<>\"\",VLOOKUP(Input!S51,Tables!$L$5:$M$9,2,FALSE), \"\")","v":""},null,"","","",null,null,null,null,null,null,null,null,null,null,null,null,"00:00:00",{"$f":"MIN(AC51,AD51)/Tables!B$3","v":0},{"$f":"(((DATE(YEAR(BK51)+Tables!$B$3,MONTH(BK51),DAY(BK51))-BK51)*BL51))","v":0},"00:00:00","00:00:00","00:00:00",0,"2012-01-01",0,{"$f":"1","v":1},0,-40909,null,null,null,null,null,null,null,null,"",""]
[null,null,null,null,null,null,null,null,null,null,null,null,null,null,null,null,null,null,null,null,"",{"$f":"IF(U52<>\"\", U52*$G$2*Tables!$B$1,\"\")","v":""},null,"",{"$f":"IF($E52<>\"\",VLOOKUP(Input!$X52,Tables!$E$5:$G$200,2,FALSE), \"\")","v":""},{"$f":"IF($F52=\"\",\"\", VLOOKUP(Input!$X52,Tables!$E$5:$G$200,3,FALSE))","v":""},"","",null,null,"",null,{"$f":"IF($E52<>\"\",VLOOKUP(Input!J52,Tables!$L$5:$M$9,2,FALSE), \"\")","v":""},null,"",null,"",{"$f":"IF($N52<>\"\",VLOOKUP(Input!$AK52,Tables!$E$5:$G$200,2,FALSE), \"\")","v":""},{"$f":"IF($O52=\"\",\"\",VLOOKUP(Input!$AK52,Tables!$E$5:$G$200,3,FALSE))","v":""},"","","","","",null,{"$f":"IF($O52<>\"\",VLOOKUP(Input!S52,Tables!$L$5:$M$9,2,FALSE), \"\")","v":""},null,"","","",null,null,null,null,null,null,null,null,null,null,null,null,"00:00:00",{"$f":"MIN(AC52,AD52)/Tables!B$3","v":0},{"$f":"(((DATE(YEAR(BK52)+Tables!$B$3,MONTH(BK52),DAY(BK52))-BK52)*BL52))","v":0},"00:00:00","00:00:00","00:00:00",0,"2012-01-01",0,{"$f":"1","v":1},0,-40909,null,null,null,null,null,null,null,null,"",""]
[null,null,null,null,null,null,null,null,null,null,null,null,null,null,null,null,null,null,null,null,"",{"$f":"IF(U53<>\"\", U53*$G$2*Tables!$B$1,\"\")","v":""},null,"",{"$f":"IF($E53<>\"\",VLOOKUP(Input!$X53,Tables!$E$5:$G$200,2,FALSE), \"\")","v":""},{"$f":"IF($F53=\"\",\"\", VLOOKUP(Input!$X53,Tables!$E$5:$G$200,3,FALSE))","v":""},"","",null,null,"",null,{"$f":"IF($E53<>\"\",VLOOKUP(Input!J53,Tables!$L$5:$M$9,2,FALSE), \"\")","v":""},null,"",null,"",{"$f":"IF($N53<>\"\",VLOOKUP(Input!$AK53,Tables!$E$5:$G$200,2,FALSE), \"\")","v":""},{"$f":"IF($O53=\"\",\"\",VLOOKUP(Input!$AK53,Tables!$E$5:$G$200,3,FALSE))","v":""},"","","","","",null,{"$f":"IF($O53<>\"\",VLOOKUP(Input!S53,Tables!$L$5:$M$9,2,FALSE), \"\")","v":""},null,"","","",null,null,null,null,null,null,null,null,null,null,null,null,"00:00:00",{"$f":"MIN(AC53,AD53)/Tables!B$3","v":0},{"$f":"(((DATE(YEAR(BK53)+Tables!$B$3,MONTH(BK53),DAY(BK53))-BK53)*BL53))","v":0},"00:00:00","00:00:00","00:00:00",0,"2012-01-01",0,{"$f":"1","v":1},0,-40909,null,null,null,null,null,null,null,null,"",""]
[null,null,null,null,null,null,null,null,null,null,null,null,null,null,null,null,null,null,null,null,"",{"$f":"IF(U54<>\"\", U54*$G$2*Tables!$B$1,\"\")","v":""},null,"",{"$f":"IF($E54<>\"\",VLOOKUP(Input!$X54,Tables!$E$5:$G$200,2,FALSE), \"\")","v":""},{"$f":"IF($F54=\"\",\"\", VLOOKUP(Input!$X54,Tables!$E$5:$G$200,3,FALSE))","v":""},"","",null,null,"",null,{"$f":"IF($E54<>\"\",VLOOKUP(Input!J54,Tables!$L$5:$M$9,2,FALSE), \"\")","v":""},null,"",null,"",{"$f":"IF($N54<>\"\",VLOOKUP(Input!$AK54,Tables!$E$5:$G$200,2,FALSE), \"\")","v":""},{"$f":"IF($O54=\"\",\"\",VLOOKUP(Input!$AK54,Tables!$E$5:$G$200,3,FALSE))","v":""},"","","","","",null,{"$f":"IF($O54<>\"\",VLOOKUP(Input!S54,Tables!$L$5:$M$9,2,FALSE), \"\")","v":""},null,"","","",null,null,null,null,null,null,null,null,null,null,null,null,"00:00:00",{"$f":"MIN(AC54,AD54)/Tables!B$3","v":0},{"$f":"(((DATE(YEAR(BK54)+Tables!$B$3,MONTH(BK54),DAY(BK54))-BK54)*BL54))","v":0},"00:00:00","00:00:00","00:00:00",0,"2012-01-01",0,{"$f":"1","v":1},0,-40909,null,null,null,null,null,null,null,null,"",""]
[null,null,null,null,null,null,null,null,null,null,null,null,null,null,null,null,null,null,null,null,"",{"$f":"IF(U55<>\"\", U55*$G$2*Tables!$B$1,\"\")","v":""},null,"",{"$f":"IF($E55<>\"\",VLOOKUP(Input!$X55,Tables!$E$5:$G$200,2,FALSE), \"\")","v":""},{"$f":"IF($F55=\"\",\"\", VLOOKUP(Input!$X55,Tables!$E$5:$G$200,3,FALSE))","v":""},"","",null,null,"",null,{"$f":"IF($E55<>\"\",VLOOKUP(Input!J55,Tables!$L$5:$M$9,2,FALSE), \"\")","v":""},null,"",null,"",{"$f":"IF($N55<>\"\",VLOOKUP(Input!$AK55,Tables!$E$5:$G$200,2,FALSE), \"\")","v":""},{"$f":"IF($O55=\"\",\"\",VLOOKUP(Input!$AK55,Tables!$E$5:$G$200,3,FALSE))","v":""},"","","","","",null,{"$f":"IF($O55<>\"\",VLOOKUP(Input!S55,Tables!$L$5:$M$9,2,FALSE), \"\")","v":""},null,"","","",null,null,null,null,null,null,null,null,null,null,null,null,"00:00:00",{"$f":"MIN(AC55,AD55)/Tables!B$3","v":0},{"$f":"(((DATE(YEAR(BK55)+Tables!$B$3,MONTH(BK55),DAY(BK55))-BK55)*BL55))","v":0},"00:00:00","00:00:00","00:00:00",0,"2012-01-01",0,{"$f":"1","v":1},0,-40909,null,null,null,null,null,null,null,null,"",""]
[null,null,null,null,null,null,null,null,null,null,null,null,null,null,null,null,null,null,null,null,"",{"$f":"IF(U56<>\"\", U56*$G$2*Tables!$B$1,\"\")","v":""},null,"",{"$f":"IF($E56<>\"\",VLOOKUP(Input!$X56,Tables!$E$5:$G$200,2,FALSE), \"\")","v":""},{"$f":"IF($F56=\"\",\"\", VLOOKUP(Input!$X56,Tables!$E$5:$G$200,3,FALSE))","v":""},"","",null,null,"",null,{"$f":"IF($E56<>\"\",VLOOKUP(Input!J56,Tables!$L$5:$M$9,2,FALSE), \"\")","v":""},null,"",null,"",{"$f":"IF($N56<>\"\",VLOOKUP(Input!$AK56,Tables!$E$5:$G$200,2,FALSE), \"\")","v":""},{"$f":"IF($O56=\"\",\"\",VLOOKUP(Input!$AK56,Tables!$E$5:$G$200,3,FALSE))","v":""},"","","","","",null,{"$f":"IF($O56<>\"\",VLOOKUP(Input!S56,Tables!$L$5:$M$9,2,FALSE), \"\")","v":""},null,"","","",null,null,null,null,null,null,null,null,null,null,null,null,"00:00:00",{"$f":"MIN(AC56,AD56)/Tables!B$3","v":0},{"$f":"(((DATE(YEAR(BK56)+Tables!$B$3,MONTH(BK56),DAY(BK56))-BK56)*BL56))","v":0},"00:00:00","00:00:00","00:00:00",0,"2012-01-01",0,{"$f":"1","v":1},0,-40909,null,null,null,null,null,null,null,null,"",""]
[null,null,null,null,null,null,null,null,null,null,null,null,null,null,null,null,null,null,null,null,"",{"$f":"IF(U57<>\"\", U57*$G$2*Tables!$B$1,\"\")","v":""},null,"",{"$f":"IF($E57<>\"\",VLOOKUP(Input!$X57,Tables!$E$5:$G$200,2,FALSE), \"\")","v":""},{"$f":"IF($F57=\"\",\"\", VLOOKUP(Input!$X57,Tables!$E$5:$G$200,3,FALSE))","v":""},"","",null,null,"",null,{"$f":"IF($E57<>\"\",VLOOKUP(Input!J57,Tables!$L$5:$M$9,2,FALSE), \"\")","v":""},null,"",null,"",{"$f":"IF($N57<>\"\",VLOOKUP(Input!$AK57,Tables!$E$5:$G$200,2,FALSE), \"\")","v":""},{"$f":"IF($O57=\"\",\"\",VLOOKUP(Input!$AK57,Tables!$E$5:$G$200,3,FALSE))","v":""},"","","","","",null,{"$f":"IF($O57<>\"\",VLOOKUP(Input!S57,Tables!$L$5:$M$9,2,FALSE), \"\")","v":""},null,"","","",null,null,null,null,null,null,null,null,null,null,null,null,"00:00:00",{"$f":"MIN(AC57,AD57)/Tables!B$3","v":0},{"$f":"(((DATE(YEAR(BK57)+Tables!$B$3,MONTH(BK57),DAY(BK57))-BK57)*BL57))","v":0},"00:00:00","00:00:00","00:00:00",0,"2012-01-01",0,{"$f":"1","v":1},0,-40909,null,null,null,null,null,null,null,null,"",""]
[null,null,null,null,null,null,null,null,null,null,null,null,null,null,null,null,null,null,null,null,"",{"$f":"IF(U58<>\"\", U58*$G$2*Tables!$B$1,\"\")","v":""},null,"",{"$f":"IF($E58<>\"\",VLOOKUP(Input!$X58,Tables!$E$5:$G$200,2,FALSE), \"\")","v":""},{"$f":"IF($F58=\"\",\"\", VLOOKUP(Input!$X58,Tables!$E$5:$G$200,3,FALSE))","v":""},"","",null,null,"",null,{"$f":"IF($E58<>\"\",VLOOKUP(Input!J58,Tables!$L$5:$M$9,2,FALSE), \"\")","v":""},null,"",null,"",{"$f":"IF($N58<>\"\",VLOOKUP(Input!$AK58,Tables!$E$5:$G$200,2,FALSE), \"\")","v":""},{"$f":"IF($O58=\"\",\"\",VLOOKUP(Input!$AK58,Tables!$E$5:$G$200,3,FALSE))","v":""},"","","","","",null,{"$f":"IF($O58<>\"\",VLOOKUP(Input!S58,Tables!$L$5:$M$9,2,FALSE), \"\")","v":""},null,"","","",null,null,null,null,null,null,null,null,null,null,null,null,"00:00:00",{"$f":"MIN(AC58,AD58)/Tables!B$3","v":0},{"$f":"(((DATE(YEAR(BK58)+Tables!$B$3,MONTH(BK58),DAY(BK58))-BK58)*BL58))","v":0},"00:00:00","00:00:00","00:00:00",0,"2012-01-01",0,{"$f":"1","v":1},0,-40909,null,null,null,null,null,null,null,null,"",""]
[null,null,null,null,null,null,null,null,null,null,null,null,null,null,null,null,null,null,null,null,"",{"$f":"IF(U59<>\"\", U59*$G$2*Tables!$B$1,\"\")","v":""},null,"",{"$f":"IF($E59<>\"\",VLOOKUP(Input!$X59,Tables!$E$5:$G$200,2,FALSE), \"\")","v":""},{"$f":"IF($F59=\"\",\"\", VLOOKUP(Input!$X59,Tables!$E$5:$G$200,3,FALSE))","v":""},"","",null,null,"",null,{"$f":"IF($E59<>\"\",VLOOKUP(Input!J59,Tables!$L$5:$M$9,2,FALSE), \"\")","v":""},null,"",null,"",{"$f":"IF($N59<>\"\",VLOOKUP(Input!$AK59,Tables!$E$5:$G$200,2,FALSE), \"\")","v":""},{"$f":"IF($O59=\"\",\"\",VLOOKUP(Input!$AK59,Tables!$E$5:$G$200,3,FALSE))","v":""},"","","","","",null,{"$f":"IF($O59<>\"\",VLOOKUP(Input!S59,Tables!$L$5:$M$9,2,FALSE), \"\")","v":""},null,"","","",null,null,null,null,null,null,null,null,null,null,null,null,"00:00:00",{"$f":"MIN(AC59,AD59)/Tables!B$3","v":0},{"$f":"(((DATE(YEAR(BK59)+Tables!$B$3,MONTH(BK59),DAY(BK59))-BK59)*BL59))","v":0},"00:00:00","00:00:00","00:00:00",0,"2012-01-01",0,{"$f":"1","v":1},0,-40909,null,null,null,null,null,null,null,null,"",""]
[null,null,null,null,null,null,null,null,null,null,null,null,null,null,null,null,null,null,null,null,"",{"$f":"IF(U60<>\"\", U60*$G$2*Tables!$B$1,\"\")","v":""},null,"",{"$f":"IF($E60<>\"\",VLOOKUP(Input!$X60,Tables!$E$5:$G$200,2,FALSE), \"\")","v":""},{"$f":"IF($F60=\"\",\"\", VLOOKUP(Input!$X60,Tables!$E$5:$G$200,3,FALSE))","v":""},"","",null,null,"",null,{"$f":"IF($E60<>\"\",VLOOKUP(Input!J60,Tables!$L$5:$M$9,2,FALSE), \"\")","v":""},null,"",null,"",{"$f":"IF($N60<>\"\",VLOOKUP(Input!$AK60,Tables!$E$5:$G$200,2,FALSE), \"\")","v":""},{"$f":"IF($O60=\"\",\"\",VLOOKUP(Input!$AK60,Tables!$E$5:$G$200,3,FALSE))","v":""},"","","","","",null,{"$f":"IF($O60<>\"\",VLOOKUP(Input!S60,Tables!$L$5:$M$9,2,FALSE), \"\")","v":""},null,"","","",null,null,null,null,null,null,null,null,null,null,null,null,"00:00:00",{"$f":"MIN(AC60,AD60)/Tables!B$3","v":0},{"$f":"(((DATE(YEAR(BK60)+Tables!$B$3,MONTH(BK60),DAY(BK60))-BK60)*BL60))","v":0},"00:00:00","00:00:00","00:00:00",0,"2012-01-01",0,{"$f":"1","v":1},0,-40909,null,null,null,null,null,null,null,null,"",""]
[null,null,null,null,null,null,null,null,null,null,null,null,null,null,null,null,null,null,null,null,"",{"$f":"IF(U61<>\"\", U61*$G$2*Tables!$B$1,\"\")","v":""},null,"",{"$f":"IF($E61<>\"\",VLOOKUP(Input!$X61,Tables!$E$5:$G$200,2,FALSE), \"\")","v":""},{"$f":"IF($F61=\"\",\"\", VLOOKUP(Input!$X61,Tables!$E$5:$G$200,3,FALSE))","v":""},"","",null,null,"",null,{"$f":"IF($E61<>\"\",VLOOKUP(Input!J61,Tables!$L$5:$M$9,2,FALSE), \"\")","v":""},null,"",null,"",{"$f":"IF($N61<>\"\",VLOOKUP(Input!$AK61,Tables!$E$5:$G$200,2,FALSE), \"\")","v":""},{"$f":"IF($O61=\"\",\"\",VLOOKUP(Input!$AK61,Tables!$E$5:$G$200,3,FALSE))","v":""},"","","","","",null,{"$f":"IF($O61<>\"\",VLOOKUP(Input!S61,Tables!$L$5:$M$9,2,FALSE), \"\")","v":""},null,"","","",null,null,null,null,null,null,null,null,null,null,null,null,"00:00:00",{"$f":"MIN(AC61,AD61)/Tables!B$3","v":0},{"$f":"(((DATE(YEAR(BK61)+Tables!$B$3,MONTH(BK61),DAY(BK61))-BK61)*BL61))","v":0},"00:00:00","00:00:00","00:00:00",0,"2012-01-01",0,{"$f":"1","v":1},0,-40909,null,null,null,null,null,null,null,null,"",""]
[null,null,null,null,null,null,null,null,null,null,null,null,null,null,null,null,null,null,null,null,"",{"$f":"IF(U62<>\"\", U62*$G$2*Tables!$B$1,\"\")","v":""},null,"",{"$f":"IF($E62<>\"\",VLOOKUP(Input!$X62,Tables!$E$5:$G$200,2,FALSE), \"\")","v":""},{"$f":"IF($F62=\"\",\"\", VLOOKUP(Input!$X62,Tables!$E$5:$G$200,3,FALSE))","v":""},"","",null,null,"",null,{"$f":"IF($E62<>\"\",VLOOKUP(Input!J62,Tables!$L$5:$M$9,2,FALSE), \"\")","v":""},null,"",null,"",{"$f":"IF($N62<>\"\",VLOOKUP(Input!$AK62,Tables!$E$5:$G$200,2,FALSE), \"\")","v":""},{"$f":"IF($O62=\"\",\"\",VLOOKUP(Input!$AK62,Tables!$E$5:$G$200,3,FALSE))","v":""},"","","","","",null,{"$f":"IF($O62<>\"\",VLOOKUP(Input!S62,Tables!$L$5:$M$9,2,FALSE), \"\")","v":""},null,"","","",null,null,null,null,null,null,null,null,null,null,null,null,"00:00:00",{"$f":"MIN(AC62,AD62)/Tables!B$3","v":0},{"$f":"(((DATE(YEAR(BK62)+Tables!$B$3,MONTH(BK62),DAY(BK62))-BK62)*BL62))","v":0},"00:00:00","00:00:00","00:00:00",0,"2012-01-01",0,{"$f":"1","v":1},0,-40909,null,null,null,null,null,null,null,null,"",""]
[null,null,null,null,null,null,null,null,null,null,null,null,null,null,null,null,null,null,null,null,"",{"$f":"IF(U63<>\"\", U63*$G$2*Tables!$B$1,\"\")","v":""},null,"",{"$f":"IF($E63<>\"\",VLOOKUP(Input!$X63,Tables!$E$5:$G$200,2,FALSE), \"\")","v":""},{"$f":"IF($F63=\"\",\"\", VLOOKUP(Input!$X63,Tables!$E$5:$G$200,3,FALSE))","v":""},"","",null,null,"",null,{"$f":"IF($E63<>\"\",VLOOKUP(Input!J63,Tables!$L$5:$M$9,2,FALSE), \"\")","v":""},null,"",null,"",{"$f":"IF($N63<>\"\",VLOOKUP(Input!$AK63,Tables!$E$5:$G$200,2,FALSE), \"\")","v":""},{"$f":"IF($O63=\"\",\"\",VLOOKUP(Input!$AK63,Tables!$E$5:$G$200,3,FALSE))","v":""},"","","","","",null,{"$f":"IF($O63<>\"\",VLOOKUP(Input!S63,Tables!$L$5:$M$9,2,FALSE), \"\")","v":""},null,"","","",null,null,null,null,null,null,null,null,null,null,null,null,"00:00:00",{"$f":"MIN(AC63,AD63)/Tables!B$3","v":0},{"$f":"(((DATE(YEAR(BK63)+Tables!$B$3,MONTH(BK63),DAY(BK63))-BK63)*BL63))","v":0},"00:00:00","00:00:00","00:00:00",0,"2012-01-01",0,{"$f":"1","v":1},0,-40909,null,null,null,null,null,null,null,null,"",""]
[null,null,null,null,null,null,null,null,null,null,null,null,null,null,null,null,null,null,null,null,"",{"$f":"IF(U64<>\"\", U64*$G$2*Tables!$B$1,\"\")","v":""},null,"",{"$f":"IF($E64<>\"\",VLOOKUP(Input!$X64,Tables!$E$5:$G$200,2,FALSE), \"\")","v":""},{"$f":"IF($F64=\"\",\"\", VLOOKUP(Input!$X64,Tables!$E$5:$G$200,3,FALSE))","v":""},"","",null,null,"",null,{"$f":"IF($E64<>\"\",VLOOKUP(Input!J64,Tables!$L$5:$M$9,2,FALSE), \"\")","v":""},null,"",null,"",{"$f":"IF($N64<>\"\",VLOOKUP(Input!$AK64,Tables!$E$5:$G$200,2,FALSE), \"\")","v":""},{"$f":"IF($O64=\"\",\"\",VLOOKUP(Input!$AK64,Tables!$E$5:$G$200,3,FALSE))","v":""},"","","","","",null,{"$f":"IF($O64<>\"\",VLOOKUP(Input!S64,Tables!$L$5:$M$9,2,FALSE), \"\")","v":""},null,"","","",null,null,null,null,null,null,null,null,null,null,null,null,"00:00:00",{"$f":"MIN(AC64,AD64)/Tables!B$3","v":0},{"$f":"(((DATE(YEAR(BK64)+Tables!$B$3,MONTH(BK64),DAY(BK64))-BK64)*BL64))","v":0},"00:00:00","00:00:00","00:00:00",0,"2012-01-01",0,{"$f":"1","v":1},0,-40909,null,null,null,null,null,null,null,null,"",""]
[null,null,null,null,null,null,null,null,null,null,null,null,null,null,null,null,null,null,null,null,"",{"$f":"IF(U65<>\"\", U65*$G$2*Tables!$B$1,\"\")","v":""},null,"",{"$f":"IF($E65<>\"\",VLOOKUP(Input!$X65,Tables!$E$5:$G$200,2,FALSE), \"\")","v":""},{"$f":"IF($F65=\"\",\"\", VLOOKUP(Input!$X65,Tables!$E$5:$G$200,3,FALSE))","v":""},"","",null,null,"",null,{"$f":"IF($E65<>\"\",VLOOKUP(Input!J65,Tables!$L$5:$M$9,2,FALSE), \"\")","v":""},null,"",null,"",{"$f":"IF($N65<>\"\",VLOOKUP(Input!$AK65,Tables!$E$5:$G$200,2,FALSE), \"\")","v":""},{"$f":"IF($O65=\"\",\"\",VLOOKUP(Input!$AK65,Tables!$E$5:$G$200,3,FALSE))","v":""},"","","","","",null,{"$f":"IF($O65<>\"\",VLOOKUP(Input!S65,Tables!$L$5:$M$9,2,FALSE), \"\")","v":""},null,"","","",null,null,null,null,null,null,null,null,null,null,null,null,"00:00:00",{"$f":"MIN(AC65,AD65)/Tables!B$3","v":0},{"$f":"(((DATE(YEAR(BK65)+Tables!$B$3,MONTH(BK65),DAY(BK65))-BK65)*BL65))","v":0},"00:00:00","00:00:00","00:00:00",0,"2012-01-01",0,{"$f":"1","v":1},0,-40909,null,null,null,null,null,null,null,null,"",""]
[null,null,null,null,null,null,null,null,null,null,null,null,null,null,null,null,null,null,null,null,"",{"$f":"IF(U66<>\"\", U66*$G$2*Tables!$B$1,\"\")","v":""},null,"",{"$f":"IF($E66<>\"\",VLOOKUP(Input!$X66,Tables!$E$5:$G$200,2,FALSE), \"\")","v":""},{"$f":"IF($F66=\"\",\"\", VLOOKUP(Input!$X66,Tables!$E$5:$G$200,3,FALSE))","v":""},"","",null,null,"",null,{"$f":"IF($E66<>\"\",VLOOKUP(Input!J66,Tables!$L$5:$M$9,2,FALSE), \"\")","v":""},null,"",null,"",{"$f":"IF($N66<>\"\",VLOOKUP(Input!$AK66,Tables!$E$5:$G$200,2,FALSE), \"\")","v":""},{"$f":"IF($O66=\"\",\"\",VLOOKUP(Input!$AK66,Tables!$E$5:$G$200,3,FALSE))","v":""},"","","","","",null,{"$f":"IF($O66<>\"\",VLOOKUP(Input!S66,Tables!$L$5:$M$9,2,FALSE), \"\")","v":""},null,"","","",null,null,null,null,null,null,null,null,null,null,null,null,"00:00:00",{"$f":"MIN(AC66,AD66)/Tables!B$3","v":0},{"$f":"(((DATE(YEAR(BK66)+Tables!$B$3,MONTH(BK66),DAY(BK66))-BK66)*BL66))","v":0},"00:00:00","00:00:00","00:00:00",0,"2012-01-01",0,{"$f":"1","v":1},0,-40909,null,null,null,null,null,null,null,null,"",""]
[null,null,null,null,null,null,null,null,null,null,null,null,null,null,null,null,null,null,null,null,"",{"$f":"IF(U67<>\"\", U67*$G$2*Tables!$B$1,\"\")","v":""},null,"",{"$f":"IF($E67<>\"\",VLOOKUP(Input!$X67,Tables!$E$5:$G$200,2,FALSE), \"\")","v":""},{"$f":"IF($F67=\"\",\"\", VLOOKUP(Input!$X67,Tables!$E$5:$G$200,3,FALSE))","v":""},"","",null,null,"",null,{"$f":"IF($E67<>\"\",VLOOKUP(Input!J67,Tables!$L$5:$M$9,2,FALSE), \"\")","v":""},null,"",null,"",{"$f":"IF($N67<>\"\",VLOOKUP(Input!$AK67,Tables!$E$5:$G$200,2,FALSE), \"\")","v":""},{"$f":"IF($O67=\"\",\"\",VLOOKUP(Input!$AK67,Tables!$E$5:$G$200,3,FALSE))","v":""},"","","","","",null,{"$f":"IF($O67<>\"\",VLOOKUP(Input!S67,Tables!$L$5:$M$9,2,FALSE), \"\")","v":""},null,"","","",null,null,null,null,null,null,null,null,null,null,null,null,"00:00:00",{"$f":"MIN(AC67,AD67)/Tables!B$3","v":0},{"$f":"(((DATE(YEAR(BK67)+Tables!$B$3,MONTH(BK67),DAY(BK67))-BK67)*BL67))","v":0},"00:00:00","00:00:00","00:00:00",0,"2012-01-01",0,{"$f":"1","v":1},0,-40909,null,null,null,null,null,null,null,null,"",""]
[null,null,null,null,null,null,null,null,null,null,null,null,null,null,null,null,null,null,null,null,"",{"$f":"IF(U68<>\"\", U68*$G$2*Tables!$B$1,\"\")","v":""},null,"",{"$f":"IF($E68<>\"\",VLOOKUP(Input!$X68,Tables!$E$5:$G$200,2,FALSE), \"\")","v":""},{"$f":"IF($F68=\"\",\"\", VLOOKUP(Input!$X68,Tables!$E$5:$G$200,3,FALSE))","v":""},"","",null,null,"",null,{"$f":"IF($E68<>\"\",VLOOKUP(Input!J68,Tables!$L$5:$M$9,2,FALSE), \"\")","v":""},null,"",null,"",{"$f":"IF($N68<>\"\",VLOOKUP(Input!$AK68,Tables!$E$5:$G$200,2,FALSE), \"\")","v":""},{"$f":"IF($O68=\"\",\"\",VLOOKUP(Input!$AK68,Tables!$E$5:$G$200,3,FALSE))","v":""},"","","","","",null,{"$f":"IF($O68<>\"\",VLOOKUP(Input!S68,Tables!$L$5:$M$9,2,FALSE), \"\")","v":""},null,"","","",null,null,null,null,null,null,null,null,null,null,null,null,"00:00:00",{"$f":"MIN(AC68,AD68)/Tables!B$3","v":0},{"$f":"(((DATE(YEAR(BK68)+Tables!$B$3,MONTH(BK68),DAY(BK68))-BK68)*BL68))","v":0},"00:00:00","00:00:00","00:00:00",0,"2012-01-01",0,{"$f":"1","v":1},0,-40909,null,null,null,null,null,null,null,null,"",""]
[null,null,null,null,null,null,null,null,null,null,null,null,null,null,null,null,null,null,null,null,"",{"$f":"IF(U69<>\"\", U69*$G$2*Tables!$B$1,\"\")","v":""},null,"",{"$f":"IF($E69<>\"\",VLOOKUP(Input!$X69,Tables!$E$5:$G$200,2,FALSE), \"\")","v":""},{"$f":"IF($F69=\"\",\"\", VLOOKUP(Input!$X69,Tables!$E$5:$G$200,3,FALSE))","v":""},"","",null,null,"",null,{"$f":"IF($E69<>\"\",VLOOKUP(Input!J69,Tables!$L$5:$M$9,2,FALSE), \"\")","v":""},null,"",null,"",{"$f":"IF($N69<>\"\",VLOOKUP(Input!$AK69,Tables!$E$5:$G$200,2,FALSE), \"\")","v":""},{"$f":"IF($O69=\"\",\"\",VLOOKUP(Input!$AK69,Tables!$E$5:$G$200,3,FALSE))","v":""},"","","","","",null,{"$f":"IF($O69<>\"\",VLOOKUP(Input!S69,Tables!$L$5:$M$9,2,FALSE), \"\")","v":""},null,"","","",null,null,null,null,null,null,null,null,null,null,null,null,"00:00:00",{"$f":"MIN(AC69,AD69)/Tables!B$3","v":0},{"$f":"(((DATE(YEAR(BK69)+Tables!$B$3,MONTH(BK69),DAY(BK69))-BK69)*BL69))","v":0},"00:00:00","00:00:00","00:00:00",0,"2012-01-01",0,{"$f":"1","v":1},0,-40909,null,null,null,null,null,null,null,null,"",""]
[null,null,null,null,null,null,null,null,null,null,null,null,null,null,null,null,null,null,null,null,"",{"$f":"IF(U70<>\"\", U70*$G$2*Tables!$B$1,\"\")","v":""},null,"",{"$f":"IF($E70<>\"\",VLOOKUP(Input!$X70,Tables!$E$5:$G$200,2,FALSE), \"\")","v":""},{"$f":"IF($F70=\"\",\"\", VLOOKUP(Input!$X70,Tables!$E$5:$G$200,3,FALSE))","v":""},"","",null,null,"",null,{"$f":"IF($E70<>\"\",VLOOKUP(Input!J70,Tables!$L$5:$M$9,2,FALSE), \"\")","v":""},null,"",null,"",{"$f":"IF($N70<>\"\",VLOOKUP(Input!$AK70,Tables!$E$5:$G$200,2,FALSE), \"\")","v":""},{"$f":"IF($O70=\"\",\"\",VLOOKUP(Input!$AK70,Tables!$E$5:$G$200,3,FALSE))","v":""},"","","","","",null,{"$f":"IF($O70<>\"\",VLOOKUP(Input!S70,Tables!$L$5:$M$9,2,FALSE), \"\")","v":""},null,"","","",null,null,null,null,null,null,null,null,null,null,null,null,"00:00:00",{"$f":"MIN(AC70,AD70)/Tables!B$3","v":0},{"$f":"(((DATE(YEAR(BK70)+Tables!$B$3,MONTH(BK70),DAY(BK70))-BK70)*BL70))","v":0},"00:00:00","00:00:00","00:00:00",0,"2012-01-01",0,{"$f":"1","v":1},0,-40909,null,null,null,null,null,null,null,null,"",""]
[null,null,null,null,null,null,null,null,null,null,null,null,null,null,null,null,null,null,null,null,{"$f":"IF(AW71<>\"\",AW71, \"\")","v":""},{"$f":"IF(U71<>\"\", U71*$G$2*Tables!$B$1,\"\")","v":""},null,"",{"$f":"IF($E71<>\"\",VLOOKUP(Input!$X71,Tables!$E$5:$G$200,2,FALSE), \"\")","v":""},{"$f":"IF($F71=\"\",\"\", VLOOKUP(Input!$X71,Tables!$E$5:$G$200,3,FALSE))","v":""},{"$f":"IF($E71<>\"\",C71*(Y71*F71), \"\")","v":""},{"$f":"IF(X71<>\"\",C71*Z71,\"\")","v":""},null,null,"",null,{"$f":"IF($E71<>\"\",VLOOKUP(Input!J71,Tables!$L$5:$M$9,2,FALSE), \"\")","v":""},null,{"$f":"IF($E71<>\"\",((AA71*AC71+AB71*AD71)*AE71*AF71*AG71)/10^6, \"\")","v":""},null,"",{"$f":"IF($N71<>\"\",VLOOKUP(Input!$AK71,Tables!$E$5:$G$200,2,FALSE), \"\")","v":""},{"$f":"IF($O71=\"\",\"\",VLOOKUP(Input!$AK71,Tables!$E$5:$G$200,3,FALSE))","v":""},{"$f":"IF($E71<>\"\",L71*(AL71*O71), \"\")","v":""},{"$f":"IF(AK71<>\"\",AM71*L71,\"\")","v":""},"","","",null,{"$f":"IF($O71<>\"\",VLOOKUP(Input!S71,Tables!$L$5:$M$9,2,FALSE), \"\")","v":""},null,{"$f":"IF($E71<>\"\",(AN71*AP71+AO71*AQ71)*AR71*AS71*AT71/10^6, \"\")","v":""},{"$f":"IF($O71<>\"\",AI71-AV71,\"\")","v":""},{"$f":"IF($O71<>\"\",AW71*G$2,\"\")","v":""},null,null,null,null,null,null,null,null,null,null,null,null,"00:00:00",{"$f":"MIN(AC71,AD71)/Tables!B$3","v":0},{"$f":"(((DATE(YEAR(BK71)+Tables!$B$3,MONTH(BK71),DAY(BK71))-BK71)*BL71))","v":0},{"$f":"BK71+BM71","v":"00:00:00"},"00:00:00","00:00:00",{"$f":"BN71-BP71","v":0},"2012-01-01",{"$f":"IF((BN71-BR71)<0,0,(BN71-BR71))","v":0},{"$f":"1","v":1},0,-40909,null,null,null,null,null,null,null,null,"",""]
[null,null,null,null,null,null,null,null,null,null,null,null,null,null,null,null,null,null,null,null,"",{"$f":"IF(U72<>\"\", U72*$G$2*Tables!$B$1,\"\")","v":""},null,"",{"$f":"IF($E72<>\"\",VLOOKUP(Input!$X72,Tables!$E$5:$G$200,2,FALSE), \"\")","v":""},{"$f":"IF($F72=\"\",\"\", VLOOKUP(Input!$X72,Tables!$E$5:$G$200,3,FALSE))","v":""},"","",null,null,"",null,{"$f":"IF($E72<>\"\",VLOOKUP(Input!J72,Tables!$L$5:$M$9,2,FALSE), \"\")","v":""},null,"",null,"",{"$f":"IF($N72<>\"\",VLOOKUP(Input!$AK72,Tables!$E$5:$G$200,2,FALSE), \"\")","v":""},{"$f":"IF($O72=\"\",\"\",VLOOKUP(Input!$AK72,Tables!$E$5:$G$200,3,FALSE))","v":""},"","","","","",null,{"$f":"IF($O72<>\"\",VLOOKUP(Input!S72,Tables!$L$5:$M$9,2,FALSE), \"\")","v":""},null,"","","",null,null,null,null,null,null,null,null,null,null,null,null,"00:00:00",{"$f":"MIN(AC72,AD72)/Tables!B$3","v":0},{"$f":"(((DATE(YEAR(BK72)+Tables!$B$3,MONTH(BK72),DAY(BK72))-BK72)*BL72))","v":0},"00:00:00","00:00:00",{"$f":"IF(BK72>=BO72,BK72,BO72)","v":"00:00:00"},0,"2012-01-01",0,{"$f":"1","v":1},{"$f":"BK72-BO72","v":0},{"$f":"BK72-BR72","v":-40909},null,null,null,null,null,null,null,null,{"$f":"IF($O72=\"\",\"\",IF(AY72=\"N\",IF(AZ72=\"N\",IF(BA72=\"N\",\"NO\",\"YES\"),\"YES\"),\"YES\"))","v":""},{"$f":"IF($O72=\"\",\"\",IF(YEAR(BK72)>YEAR($BJ$5),YEAR(BK72),YEAR($BJ$5)))","v":""}]
[null,null,null,null,null,null,null,null,null,null,null,null,null,null,null,null,null,null,null,null,"",{"$f":"IF(U73<>\"\", U73*$G$2*Tables!$B$1,\"\")","v":""},null,"",{"$f":"IF($E73<>\"\",VLOOKUP(Input!$X73,Tables!$E$5:$G$200,2,FALSE), \"\")","v":""},{"$f":"IF($F73=\"\",\"\", VLOOKUP(Input!$X73,Tables!$E$5:$G$200,3,FALSE))","v":""},"","",null,null,"",null,{"$f":"IF($E73<>\"\",VLOOKUP(Input!J73,Tables!$L$5:$M$9,2,FALSE), \"\")","v":""},null,"",null,"",{"$f":"IF($N73<>\"\",VLOOKUP(Input!$AK73,Tables!$E$5:$G$200,2,FALSE), \"\")","v":""},{"$f":"IF($O73=\"\",\"\",VLOOKUP(Input!$AK73,Tables!$E$5:$G$200,3,FALSE))","v":""},"","","","","",null,{"$f":"IF($O73<>\"\",VLOOKUP(Input!S73,Tables!$L$5:$M$9,2,FALSE), \"\")","v":""},null,"","","",null,null,null,null,null,null,null,null,null,null,null,null,"00:00:00",{"$f":"MIN(AC73,AD73)/Tables!B$3","v":0},{"$f":"(((DATE(YEAR(BK73)+Tables!$B$3,MONTH(BK73),DAY(BK73))-BK73)*BL73))","v":0},"00:00:00","00:00:00","00:00:00",0,"2012-01-01",0,{"$f":"1","v":1},0,-40909,null,null,null,null,null,null,null,null,"",""]
[null,null,null,null,null,null,null,null,null,null,null,null,null,null,null,null,null,null,null,null,"",{"$f":"IF(U74<>\"\", U74*$G$2*Tables!$B$1,\"\")","v":""},null,"",{"$f":"IF($E74<>\"\",VLOOKUP(Input!$X74,Tables!$E$5:$G$200,2,FALSE), \"\")","v":""},{"$f":"IF($F74=\"\",\"\", VLOOKUP(Input!$X74,Tables!$E$5:$G$200,3,FALSE))","v":""},"","",null,null,"",null,{"$f":"IF($E74<>\"\",VLOOKUP(Input!J74,Tables!$L$5:$M$9,2,FALSE), \"\")","v":""},null,"",null,"",{"$f":"IF($N74<>\"\",VLOOKUP(Input!$AK74,Tables!$E$5:$G$200,2,FALSE), \"\")","v":""},{"$f":"IF($O74=\"\",\"\",VLOOKUP(Input!$AK74,Tables!$E$5:$G$200,3,FALSE))","v":""},"","","","","",null,{"$f":"IF($O74<>\"\",VLOOKUP(Input!S74,Tables!$L$5:$M$9,2,FALSE), \"\")","v":""},null,"","","",null,null,null,null,null,null,null,null,null,null,null,null,"00:00:00",{"$f":"MIN(AC74,AD74)/Tables!B$3","v":0},{"$f":"(((DATE(YEAR(BK74)+Tables!$B$3,MONTH(BK74),DAY(BK74))-BK74)*BL74))","v":0},"00:00:00","00:00:00","00:00:00",0,"2012-01-01",0,{"$f":"1","v":1},0,-40909,null,null,null,null,null,null,null,null,"",""]
[null,null,null,null,null,null,null,null,null,null,null,null,null,null,null,null,null,null,null,null,"",{"$f":"IF(U75<>\"\", U75*$G$2*Tables!$B$1,\"\")","v":""},null,"",{"$f":"IF($E75<>\"\",VLOOKUP(Input!$X75,Tables!$E$5:$G$200,2,FALSE), \"\")","v":""},{"$f":"IF($F75=\"\",\"\", VLOOKUP(Input!$X75,Tables!$E$5:$G$200,3,FALSE))","v":""},"","",null,null,"",null,{"$f":"IF($E75<>\"\",VLOOKUP(Input!J75,Tables!$L$5:$M$9,2,FALSE), \"\")","v":""},null,"",null,"",{"$f":"IF($N75<>\"\",VLOOKUP(Input!$AK75,Tables!$E$5:$G$200,2,FALSE), \"\")","v":""},{"$f":"IF($O75=\"\",\"\",VLOOKUP(Input!$AK75,Tables!$E$5:$G$200,3,FALSE))","v":""},"","","","","",null,{"$f":"IF($O75<>\"\",VLOOKUP(Input!S75,Tables!$L$5:$M$9,2,FALSE), \"\")","v":""},null,"","","",null,null,null,null,null,null,null,null,null,null,null,null,"00:00:00",{"$f":"MIN(AC75,AD75)/Tables!B$3","v":0},{"$f":"(((DATE(YEAR(BK75)+Tables!$B$3,MONTH(BK75),DAY(BK75))-BK75)*BL75))","v":0},"00:00:00","00:00:00","00:00:00",0,"2012-01-01",0,{"$f":"1","v":1},0,-40909,null,null,null,null,null,null,null,null,"",""]
[null,null,null,null,null,null,null,null,null,null,null,null,null,null,null,null,null,null,null,null,"",{"$f":"IF(U76<>\"\", U76*$G$2*Tables!$B$1,\"\")","v":""},null,"",{"$f":"IF($E76<>\"\",VLOOKUP(Input!$X76,Tables!$E$5:$G$200,2,FALSE), \"\")","v":""},{"$f":"IF($F76=\"\",\"\", VLOOKUP(Input!$X76,Tables!$E$5:$G$200,3,FALSE))","v":""},"","",null,null,"",null,{"$f":"IF($E76<>\"\",VLOOKUP(Input!J76,Tables!$L$5:$M$9,2,FALSE), \"\")","v":""},null,"",null,"",{"$f":"IF($N76<>\"\",VLOOKUP(Input!$AK76,Tables!$E$5:$G$200,2,FALSE), \"\")","v":""},{"$f":"IF($O76=\"\",\"\",VLOOKUP(Input!$AK76,Tables!$E$5:$G$200,3,FALSE))","v":""},"","","","","",null,{"$f":"IF($O76<>\"\",VLOOKUP(Input!S76,Tables!$L$5:$M$9,2,FALSE), \"\")","v":""},null,"","","",null,null,null,null,null,null,null,null,null,null,null,null,{"$f":"T76","v":"00:00:00"},{"$f":"MIN(AC76,AD76)/Tables!B$3","v":0},{"$f":"(((DATE(YEAR(BK76)+Tables!$B$3,MONTH(BK76),DAY(BK76))-BK76)*BL76))","v":0},"00:00:00",{"$f":"BH76","v":"00:00:00"},"00:00:00",0,{"$f":"IF(BP76>$BJ$5,BP76,$BJ$5)","v":"2012-01-01"},0,{"$f":"1","v":1},0,-40909,null,null,null,null,null,null,null,null,"",""]
[null,null,null,null,null,null,null,null,null,null,null,null,null,null,null,null,null,null,null,null,"",{"$f":"IF(U77<>\"\", U77*$G$2*Tables!$B$1,\"\")","v":""},null,"",{"$f":"IF($E77<>\"\",VLOOKUP(Input!$X77,Tables!$E$5:$G$200,2,FALSE), \"\")","v":""},{"$f":"IF($F77=\"\",\"\", VLOOKUP(Input!$X77,Tables!$E$5:$G$200,3,FALSE))","v":""},"","",null,null,"",null,{"$f":"IF($E77<>\"\",VLOOKUP(Input!J77,Tables!$L$5:$M$9,2,FALSE), \"\")","v":""},null,"",null,"",{"$f":"IF($N77<>\"\",VLOOKUP(Input!$AK77,Tables!$E$5:$G$200,2,FALSE), \"\")","v":""},{"$f":"IF($O77=\"\",\"\",VLOOKUP(Input!$AK77,Tables!$E$5:$G$200,3,FALSE))","v":""},"","","","","",null,{"$f":"IF($O77<>\"\",VLOOKUP(Input!S77,Tables!$L$5:$M$9,2,FALSE), \"\")","v":""},null,"","","",null,null,null,null,null,null,null,null,null,null,null,null,"00:00:00",{"$f":"MIN(AC77,AD77)/Tables!B$3","v":0},{"$f":"(((DATE(YEAR(BK77)+Tables!$B$3,MONTH(BK77),DAY(BK77))-BK77)*BL77))","v":0},"00:00:00","00:00:00","00:00:00",0,"2012-01-01",0,{"$f":"1","v":1},0,-40909,null,null,null,null,null,null,null,null,"",""]
[null,null,null,null,null,null,null,null,null,null,null,null,null,null,null,null,null,null,null,null,"",{"$f":"IF(U78<>\"\", U78*$G$2*Tables!$B$1,\"\")","v":""},null,"",{"$f":"IF($E78<>\"\",VLOOKUP(Input!$X78,Tables!$E$5:$G$200,2,FALSE), \"\")","v":""},{"$f":"IF($F78=\"\",\"\", VLOOKUP(Input!$X78,Tables!$E$5:$G$200,3,FALSE))","v":""},"","",null,null,"",null,{"$f":"IF($E78<>\"\",VLOOKUP(Input!J78,Tables!$L$5:$M$9,2,FALSE), \"\")","v":""},null,"",null,"",{"$f":"IF($N78<>\"\",VLOOKUP(Input!$AK78,Tables!$E$5:$G$200,2,FALSE), \"\")","v":""},{"$f":"IF($O78=\"\",\"\",VLOOKUP(Input!$AK78,Tables!$E$5:$G$200,3,FALSE))","v":""},"","","","","",null,{"$f":"IF($O78<>\"\",VLOOKUP(Input!S78,Tables!$L$5:$M$9,2,FALSE), \"\")","v":""},null,"","","",null,null,null,null,null,null,null,null,null,null,null,null,"00:00:00",{"$f":"MIN(AC78,AD78)/Tables!B$3","v":0},{"$f":"(((DATE(YEAR(BK78)+Tables!$B$3,MONTH(BK78),DAY(BK78))-BK78)*BL78))","v":0},"00:00:00","00:00:00","00:00:00",0,"2012-01-01",0,{"$f":"1","v":1},0,-40909,null,null,null,null,null,null,null,null,"",""]
[null,null,null,null,null,null,null,null,null,null,null,null,null,null,null,null,null,null,null,null,"",{"$f":"IF(U79<>\"\", U79*$G$2*Tables!$B$1,\"\")","v":""},null,"",{"$f":"IF($E79<>\"\",VLOOKUP(Input!$X79,Tables!$E$5:$G$200,2,FALSE), \"\")","v":""},{"$f":"IF($F79=\"\",\"\", VLOOKUP(Input!$X79,Tables!$E$5:$G$200,3,FALSE))","v":""},"","",null,null,"",null,{"$f":"IF($E79<>\"\",VLOOKUP(Input!J79,Tables!$L$5:$M$9,2,FALSE), \"\")","v":""},null,"",null,"",{"$f":"IF($N79<>\"\",VLOOKUP(Input!$AK79,Tables!$E$5:$G$200,2,FALSE), \"\")","v":""},{"$f":"IF($O79=\"\",\"\",VLOOKUP(Input!$AK79,Tables!$E$5:$G$200,3,FALSE))","v":""},"","","","","",null,{"$f":"IF($O79<>\"\",VLOOKUP(Input!S79,Tables!$L$5:$M$9,2,FALSE), \"\")","v":""},null,"","","",null,null,null,null,null,null,null,null,null,null,null,null,"00:00:00",{"$f":"MIN(AC79,AD79)/Tables!B$3","v":0},{"$f":"(((DATE(YEAR(BK79)+Tables!$B$3,MONTH(BK79),DAY(BK79))-BK79)*BL79))","v":0},"00:00:00","00:00:00","00:00:00",0,"2012-01-01",0,{"$f":"1","v":1},0,-40909,null,null,null,null,null,null,null,null,"",""]
[null,null,null,null,null,null,null,null,null,null,null,null,null,null,null,null,null,null,null,null,"",{"$f":"IF(U80<>\"\", U80*$G$2*Tables!$B$1,\"\")","v":""},null,{"$f":"IF(E80<>\"\", CONCATENATE(E80,\"-\",G80),\"\")","v":""},{"$f":"IF($E80<>\"\",VLOOKUP(Input!$X80,Tables!$E$5:$G$200,2,FALSE), \"\")","v":""},{"$f":"IF($F80=\"\",\"\", VLOOKUP(Input!$X80,Tables!$E$5:$G$200,3,FALSE))","v":""},"","",null,null,{"$f":"IF(W80=\"\",\"\",W80)","v":""},null,{"$f":"IF($E80<>\"\",VLOOKUP(Input!J80,Tables!$L$5:$M$9,2,FALSE), \"\")","v":""},null,"",null,{"$f":"IF(N80<>\"\", CONCATENATE(N80,\"-\",P80),\"\")","v":""},{"$f":"IF($N80<>\"\",VLOOKUP(Input!$AK80,Tables!$E$5:$G$200,2,FALSE), \"\")","v":""},{"$f":"IF($O80=\"\",\"\",VLOOKUP(Input!$AK80,Tables!$E$5:$G$200,3,FALSE))","v":""},"","",{"$f":"IF(AC80<>\"\",AC80,\"\")","v":""},{"$f":"IF(AD80<>\"\",AD80,\"\")","v":""},{"$f":"IF(W80=\"\",\"\",W80)","v":""},null,{"$f":"IF($O80<>\"\",VLOOKUP(Input!S80,Tables!$L$5:$M$9,2,FALSE), \"\")","v":""},null,"","","",null,null,null,null,null,null,null,null,null,null,null,null,"00:00:00",{"$f":"MIN(AC80,AD80)/Tables!B$3","v":0},{"$f":"(((DATE(YEAR(BK80)+Tables!$B$3,MONTH(BK80),DAY(BK80))-BK80)*BL80))","v":0},"00:00:00","00:00:00","00:00:00",0,"2012-01-01",0,{"$f":"1","v":1},0,-40909,null,null,null,null,null,null,null,null,"",""]
[null,null,null,null,null,null,null,null,null,null,null,null,null,null,null,null,null,null,null,null,"",{"$f":"IF(U81<>\"\", U81*$G$2*Tables!$B$1,\"\")","v":""},null,"",{"$f":"IF($E81<>\"\",VLOOKUP(Input!$X81,Tables!$E$5:$G$200,2,FALSE), \"\")","v":""},{"$f":"IF($F81=\"\",\"\", VLOOKUP(Input!$X81,Tables!$E$5:$G$200,3,FALSE))","v":""},"","",null,null,"",null,{"$f":"IF($E81<>\"\",VLOOKUP(Input!J81,Tables!$L$5:$M$9,2,FALSE), \"\")","v":""},null,"",null,"",{"$f":"IF($N81<>\"\",VLOOKUP(Input!$AK81,Tables!$E$5:$G$200,2,FALSE), \"\")","v":""},{"$f":"IF($O81=\"\",\"\",VLOOKUP(Input!$AK81,Tables!$E$5:$G$200,3,FALSE))","v":""},"","","","","",null,{"$f":"IF($O81<>\"\",VLOOKUP(Input!S81,Tables!$L$5:$M$9,2,FALSE), \"\")","v":""},null,"","","",null,null,null,null,null,null,null,null,null,null,null,null,"00:00:00",{"$f":"MIN(AC81,AD81)/Tables!B$3","v":0},{"$f":"(((DATE(YEAR(BK81)+Tables!$B$3,MONTH(BK81),DAY(BK81))-BK81)*BL81))","v":0},"00:00:00","00:00:00","00:00:00",0,"2012-01-01",0,{"$f":"1","v":1},0,-40909,null,null,null,null,null,null,null,null,"",""]
[null,null,null,null,null,null,null,null,null,null,null,null,null,null,null,null,null,null,null,null,"",{"$f":"IF(U82<>\"\", U82*$G$2*Tables!$B$1,\"\")","v":""},null,"",{"$f":"IF($E82<>\"\",VLOOKUP(Input!$X82,Tables!$E$5:$G$200,2,FALSE), \"\")","v":""},{"$f":"IF($F82=\"\",\"\", VLOOKUP(Input!$X82,Tables!$E$5:$G$200,3,FALSE))","v":""},"","",null,null,"",null,{"$f":"IF($E82<>\"\",VLOOKUP(Input!J82,Tables!$L$5:$M$9,2,FALSE), \"\")","v":""},null,"",null,"",{"$f":"IF($N82<>\"\",VLOOKUP(Input!$AK82,Tables!$E$5:$G$200,2,FALSE), \"\")","v":""},{"$f":"IF($O82=\"\",\"\",VLOOKUP(Input!$AK82,Tables!$E$5:$G$200,3,FALSE))","v":""},"","","","","",null,{"$f":"IF($O82<>\"\",VLOOKUP(Input!S82,Tables!$L$5:$M$9,2,FALSE), \"\")","v":""},null,"","","",null,null,null,null,null,null,null,null,null,null,null,null,"00:00:00",{"$f":"MIN(AC82,AD82)/Tables!B$3","v":0},{"$f":"(((DATE(YEAR(BK82)+Tables!$B$3,MONTH(BK82),DAY(BK82))-BK82)*BL82))","v":0},"00:00:00","00:00:00","00:00:00",0,"2012-01-01",0,{"$f":"1","v":1},0,-40909,null,null,null,null,null,null,null,null,"",""]
[null,null,null,null,null,null,null,null,null,null,null,null,null,null,null,null,null,null,null,null,"",{"$f":"IF(U83<>\"\", U83*$G$2*Tables!$B$1,\"\")","v":""},null,"",{"$f":"IF($E83<>\"\",VLOOKUP(Input!$X83,Tables!$E$5:$G$200,2,FALSE), \"\")","v":""},{"$f":"IF($F83=\"\",\"\", VLOOKUP(Input!$X83,Tables!$E$5:$G$200,3,FALSE))","v":""},"","",null,null,"",null,{"$f":"IF($E83<>\"\",VLOOKUP(Input!J83,Tables!$L$5:$M$9,2,FALSE), \"\")","v":""},null,"",null,"",{"$f":"IF($N83<>\"\",VLOOKUP(Input!$AK83,Tables!$E$5:$G$200,2,FALSE), \"\")","v":""},{"$f":"IF($O83=\"\",\"\",VLOOKUP(Input!$AK83,Tables!$E$5:$G$200,3,FALSE))","v":""},"","","","","",null,{"$f":"IF($O83<>\"\",VLOOKUP(Input!S83,Tables!$L$5:$M$9,2,FALSE), \"\")","v":""},null,"","","",null,null,null,null,null,null,null,null,null,null,null,null,"00:00:00",{"$f":"MIN(AC83,AD83)/Tables!B$3","v":0},{"$f":"(((DATE(YEAR(BK83)+Tables!$B$3,MONTH(BK83),DAY(BK83))-BK83)*BL83))","v":0},"00:00:00","00:00:00","00:00:00",0,"2012-01-01",0,{"$f":"1","v":1},0,-40909,null,null,null,null,null,null,null,null,"",""]
[null,null,null,null,null,null,null,null,null,null,null,null,null,null,null,null,null,null,null,null,"",{"$f":"IF(U84<>\"\", U84*$G$2*Tables!$B$1,\"\")","v":""},null,"",{"$f":"IF($E84<>\"\",VLOOKUP(Input!$X84,Tables!$E$5:$G$200,2,FALSE), \"\")","v":""},{"$f":"IF($F84=\"\",\"\", VLOOKUP(Input!$X84,Tables!$E$5:$G$200,3,FALSE))","v":""},"","",null,null,"",null,{"$f":"IF($E84<>\"\",VLOOKUP(Input!J84,Tables!$L$5:$M$9,2,FALSE), \"\")","v":""},null,"",null,"",{"$f":"IF($N84<>\"\",VLOOKUP(Input!$AK84,Tables!$E$5:$G$200,2,FALSE), \"\")","v":""},{"$f":"IF($O84=\"\",\"\",VLOOKUP(Input!$AK84,Tables!$E$5:$G$200,3,FALSE))","v":""},"","","","","",null,{"$f":"IF($O84<>\"\",VLOOKUP(Input!S84,Tables!$L$5:$M$9,2,FALSE), \"\")","v":""},null,"","","",null,null,null,null,null,null,null,null,null,null,null,null,"00:00:00",{"$f":"MIN(AC84,AD84)/Tables!B$3","v":0},{"$f":"(((DATE(YEAR(BK84)+Tables!$B$3,MONTH(BK84),DAY(BK84))-BK84)*BL84))","v":0},"00:00:00","00:00:00","00:00:00",0,"2012-01-01",0,{"$f":"1","v":1},0,-40909,null,null,null,null,null,null,null,null,"",""]
[null,null,null,null,null,null,null,null,null,null,null,null,null,null,null,null,null,null,null,null,"",{"$f":"IF(U85<>\"\", U85*$G$2*Tables!$B$1,\"\")","v":""},null,"",{"$f":"IF($E85<>\"\",VLOOKUP(Input!$X85,Tables!$E$5:$G$200,2,FALSE), \"\")","v":""},{"$f":"IF($F85=\"\",\"\", VLOOKUP(Input!$X85,Tables!$E$5:$G$200,3,FALSE))","v":""},"","",null,null,"",null,{"$f":"IF($E85<>\"\",VLOOKUP(Input!J85,Tables!$L$5:$M$9,2,FALSE), \"\")","v":""},null,"",null,"",{"$f":"IF($N85<>\"\",VLOOKUP(Input!$AK85,Tables!$E$5:$G$200,2,FALSE), \"\")","v":""},{"$f":"IF($O85=\"\",\"\",VLOOKUP(Input!$AK85,Tables!$E$5:$G$200,3,FALSE))","v":""},"","","","","",null,{"$f":"IF($O85<>\"\",VLOOKUP(Input!S85,Tables!$L$5:$M$9,2,FALSE), \"\")","v":""},null,"","","",null,null,null,null,null,null,null,null,null,null,null,null,"00:00:00",{"$f":"MIN(AC85,AD85)/Tables!B$3","v":0},{"$f":"(((DATE(YEAR(BK85)+Tables!$B$3,MONTH(BK85),DAY(BK85))-BK85)*BL85))","v":0},"00:00:00","00:00:00","00:00:00",0,"2012-01-01",0,{"$f":"1","v":1},0,-40909,null,null,null,null,null,null,null,null,"",""]
[null,null,null,null,null,null,null,null,null,null,null,null,null,null,null,null,null,null,null,null,"",{"$f":"IF(U86<>\"\", U86*$G$2*Tables!$B$1,\"\")","v":""},null,"",{"$f":"IF($E86<>\"\",VLOOKUP(Input!$X86,Tables!$E$5:$G$200,2,FALSE), \"\")","v":""},{"$f":"IF($F86=\"\",\"\", VLOOKUP(Input!$X86,Tables!$E$5:$G$200,3,FALSE))","v":""},"","",null,null,"",null,{"$f":"IF($E86<>\"\",VLOOKUP(Input!J86,Tables!$L$5:$M$9,2,FALSE), \"\")","v":""},null,"",null,"",{"$f":"IF($N86<>\"\",VLOOKUP(Input!$AK86,Tables!$E$5:$G$200,2,FALSE), \"\")","v":""},{"$f":"IF($O86=\"\",\"\",VLOOKUP(Input!$AK86,Tables!$E$5:$G$200,3,FALSE))","v":""},"","","","","",null,{"$f":"IF($O86<>\"\",VLOOKUP(Input!S86,Tables!$L$5:$M$9,2,FALSE), \"\")","v":""},null,"","","",null,null,null,null,null,null,null,null,null,null,null,null,"00:00:00",{"$f":"MIN(AC86,AD86)/Tables!B$3","v":0},{"$f":"(((DATE(YEAR(BK86)+Tables!$B$3,MONTH(BK86),DAY(BK86))-BK86)*BL86))","v":0},"00:00:00","00:00:00","00:00:00",0,"2012-01-01",0,{"$f":"1","v":1},0,-40909,null,null,null,null,null,null,null,null,"",""]
[null,null,null,null,null,null,null,null,null,null,null,null,null,null,null,null,null,null,null,null,"",{"$f":"IF(U87<>\"\", U87*$G$2*Tables!$B$1,\"\")","v":""},null,"",{"$f":"IF($E87<>\"\",VLOOKUP(Input!$X87,Tables!$E$5:$G$200,2,FALSE), \"\")","v":""},{"$f":"IF($F87=\"\",\"\", VLOOKUP(Input!$X87,Tables!$E$5:$G$200,3,FALSE))","v":""},"","",null,null,"",null,{"$f":"IF($E87<>\"\",VLOOKUP(Input!J87,Tables!$L$5:$M$9,2,FALSE), \"\")","v":""},null,"",null,"",{"$f":"IF($N87<>\"\",VLOOKUP(Input!$AK87,Tables!$E$5:$G$200,2,FALSE), \"\")","v":""},{"$f":"IF($O87=\"\",\"\",VLOOKUP(Input!$AK87,Tables!$E$5:$G$200,3,FALSE))","v":""},"","","","","",null,{"$f":"IF($O87<>\"\",VLOOKUP(Input!S87,Tables!$L$5:$M$9,2,FALSE), \"\")","v":""},null,"","","",null,null,null,null,null,null,null,null,null,null,null,null,"00:00:00",{"$f":"MIN(AC87,AD87)/Tables!B$3","v":0},{"$f":"(((DATE(YEAR(BK87)+Tables!$B$3,MONTH(BK87),DAY(BK87))-BK87)*BL87))","v":0},"00:00:00","00:00:00","00:00:00",0,"2012-01-01",0,{"$f":"1","v":1},0,-40909,null,null,null,null,null,null,null,null,"",""]
[null,null,null,null,null,null,null,null,null,null,null,null,null,null,null,null,null,null,null,null,"",{"$f":"IF(U88<>\"\", U88*$G$2*Tables!$B$1,\"\")","v":""},null,"",{"$f":"IF($E88<>\"\",VLOOKUP(Input!$X88,Tables!$E$5:$G$200,2,FALSE), \"\")","v":""},{"$f":"IF($F88=\"\",\"\", VLOOKUP(Input!$X88,Tables!$E$5:$G$200,3,FALSE))","v":""},"","",null,null,"",null,{"$f":"IF($E88<>\"\",VLOOKUP(Input!J88,Tables!$L$5:$M$9,2,FALSE), \"\")","v":""},null,"",null,"",{"$f":"IF($N88<>\"\",VLOOKUP(Input!$AK88,Tables!$E$5:$G$200,2,FALSE), \"\")","v":""},{"$f":"IF($O88=\"\",\"\",VLOOKUP(Input!$AK88,Tables!$E$5:$G$200,3,FALSE))","v":""},"","","","","",null,{"$f":"IF($O88<>\"\",VLOOKUP(Input!S88,Tables!$L$5:$M$9,2,FALSE), \"\")","v":""},null,"","","",null,null,null,null,null,null,null,null,null,null,null,null,"00:00:00",{"$f":"MIN(AC88,AD88)/Tables!B$3","v":0},{"$f":"(((DATE(YEAR(BK88)+Tables!$B$3,MONTH(BK88),DAY(BK88))-BK88)*BL88))","v":0},"00:00:00","00:00:00","00:00:00",0,"2012-01-01",0,{"$f":"1","v":1},0,-40909,null,null,null,null,null,null,null,null,"",""]
[null,null,null,null,null,null,null,null,null,null,null,null,null,null,null,null,null,null,null,null,"",{"$f":"IF(U89<>\"\", U89*$G$2*Tables!$B$1,\"\")","v":""},null,"",{"$f":"IF($E89<>\"\",VLOOKUP(Input!$X89,Tables!$E$5:$G$200,2,FALSE), \"\")","v":""},{"$f":"IF($F89=\"\",\"\", VLOOKUP(Input!$X89,Tables!$E$5:$G$200,3,FALSE))","v":""},"","",null,null,"",null,{"$f":"IF($E89<>\"\",VLOOKUP(Input!J89,Tables!$L$5:$M$9,2,FALSE), \"\")","v":""},null,"",null,"",{"$f":"IF($N89<>\"\",VLOOKUP(Input!$AK89,Tables!$E$5:$G$200,2,FALSE), \"\")","v":""},{"$f":"IF($O89=\"\",\"\",VLOOKUP(Input!$AK89,Tables!$E$5:$G$200,3,FALSE))","v":""},"","","","","",null,{"$f":"IF($O89<>\"\",VLOOKUP(Input!S89,Tables!$L$5:$M$9,2,FALSE), \"\")","v":""},null,"","","",null,null,null,null,null,null,null,null,null,null,null,null,"00:00:00",{"$f":"MIN(AC89,AD89)/Tables!B$3","v":0},{"$f":"(((DATE(YEAR(BK89)+Tables!$B$3,MONTH(BK89),DAY(BK89))-BK89)*BL89))","v":0},"00:00:00","00:00:00","00:00:00",0,"2012-01-01",0,{"$f":"1","v":1},0,-40909,null,null,null,null,null,null,null,null,"",""]
[null,null,null,null,null,null,null,null,null,null,null,null,null,null,null,null,null,null,null,null,"",{"$f":"IF(U90<>\"\", U90*$G$2*Tables!$B$1,\"\")","v":""},null,"",{"$f":"IF($E90<>\"\",VLOOKUP(Input!$X90,Tables!$E$5:$G$200,2,FALSE), \"\")","v":""},{"$f":"IF($F90=\"\",\"\", VLOOKUP(Input!$X90,Tables!$E$5:$G$200,3,FALSE))","v":""},"","",null,null,"",null,{"$f":"IF($E90<>\"\",VLOOKUP(Input!J90,Tables!$L$5:$M$9,2,FALSE), \"\")","v":""},null,"",null,"",{"$f":"IF($N90<>\"\",VLOOKUP(Input!$AK90,Tables!$E$5:$G$200,2,FALSE), \"\")","v":""},{"$f":"IF($O90=\"\",\"\",VLOOKUP(Input!$AK90,Tables!$E$5:$G$200,3,FALSE))","v":""},"","","","","",null,{"$f":"IF($O90<>\"\",VLOOKUP(Input!S90,Tables!$L$5:$M$9,2,FALSE), \"\")","v":""},null,"","","",null,null,null,null,null,null,null,null,null,null,null,null,"00:00:00",{"$f":"MIN(AC90,AD90)/Tables!B$3","v":0},{"$f":"(((DATE(YEAR(BK90)+Tables!$B$3,MONTH(BK90),DAY(BK90))-BK90)*BL90))","v":0},"00:00:00","00:00:00","00:00:00",0,"2012-01-01",0,{"$f":"1","v":1},0,-40909,null,null,null,null,null,null,null,null,"",""]
[null,null,null,null,null,null,null,null,null,null,null,null,null,null,null,null,null,null,null,null,"",{"$f":"IF(U91<>\"\", U91*$G$2*Tables!$B$1,\"\")","v":""},null,"",{"$f":"IF($E91<>\"\",VLOOKUP(Input!$X91,Tables!$E$5:$G$200,2,FALSE), \"\")","v":""},{"$f":"IF($F91=\"\",\"\", VLOOKUP(Input!$X91,Tables!$E$5:$G$200,3,FALSE))","v":""},"","",null,null,"",null,{"$f":"IF($E91<>\"\",VLOOKUP(Input!J91,Tables!$L$5:$M$9,2,FALSE), \"\")","v":""},null,"",null,"",{"$f":"IF($N91<>\"\",VLOOKUP(Input!$AK91,Tables!$E$5:$G$200,2,FALSE), \"\")","v":""},{"$f":"IF($O91=\"\",\"\",VLOOKUP(Input!$AK91,Tables!$E$5:$G$200,3,FALSE))","v":""},"","","","","",null,{"$f":"IF($O91<>\"\",VLOOKUP(Input!S91,Tables!$L$5:$M$9,2,FALSE), \"\")","v":""},null,"","","",null,null,null,null,null,null,null,null,null,null,null,null,"00:00:00",{"$f":"MIN(AC91,AD91)/Tables!B$3","v":0},{"$f":"(((DATE(YEAR(BK91)+Tables!$B$3,MONTH(BK91),DAY(BK91))-BK91)*BL91))","v":0},"00:00:00","00:00:00","00:00:00",0,"2012-01-01",0,{"$f":"1","v":1},0,-40909,null,null,null,null,null,null,null,null,"",""]
[null,null,null,null,null,null,null,null,null,null,null,null,null,null,null,null,null,null,null,null,"",{"$f":"IF(U92<>\"\", U92*$G$2*Tables!$B$1,\"\")","v":""},null,"",{"$f":"IF($E92<>\"\",VLOOKUP(Input!$X92,Tables!$E$5:$G$200,2,FALSE), \"\")","v":""},{"$f":"IF($F92=\"\",\"\", VLOOKUP(Input!$X92,Tables!$E$5:$G$200,3,FALSE))","v":""},"","",null,null,"",null,{"$f":"IF($E92<>\"\",VLOOKUP(Input!J92,Tables!$L$5:$M$9,2,FALSE), \"\")","v":""},null,"",null,"",{"$f":"IF($N92<>\"\",VLOOKUP(Input!$AK92,Tables!$E$5:$G$200,2,FALSE), \"\")","v":""},{"$f":"IF($O92=\"\",\"\",VLOOKUP(Input!$AK92,Tables!$E$5:$G$200,3,FALSE))","v":""},"","","","","",null,{"$f":"IF($O92<>\"\",VLOOKUP(Input!S92,Tables!$L$5:$M$9,2,FALSE), \"\")","v":""},null,"","","",null,null,null,null,null,null,null,null,null,null,null,null,"00:00:00",{"$f":"MIN(AC92,AD92)/Tables!B$3","v":0},{"$f":"(((DATE(YEAR(BK92)+Tables!$B$3,MONTH(BK92),DAY(BK92))-BK92)*BL92))","v":0},"00:00:00","00:00:00","00:00:00",0,"2012-01-01",0,{"$f":"1","v":1},0,-40909,null,null,null,null,null,null,null,null,"",""]
[null,null,null,null,null,null,null,null,null,null,null,null,null,null,null,null,null,null,null,null,"",{"$f":"IF(U93<>\"\", U93*$G$2*Tables!$B$1,\"\")","v":""},null,"",{"$f":"IF($E93<>\"\",VLOOKUP(Input!$X93,Tables!$E$5:$G$200,2,FALSE), \"\")","v":""},{"$f":"IF($F93=\"\",\"\", VLOOKUP(Input!$X93,Tables!$E$5:$G$200,3,FALSE))","v":""},"","",null,null,"",null,{"$f":"IF($E93<>\"\",VLOOKUP(Input!J93,Tables!$L$5:$M$9,2,FALSE), \"\")","v":""},null,"",null,"",{"$f":"IF($N93<>\"\",VLOOKUP(Input!$AK93,Tables!$E$5:$G$200,2,FALSE), \"\")","v":""},{"$f":"IF($O93=\"\",\"\",VLOOKUP(Input!$AK93,Tables!$E$5:$G$200,3,FALSE))","v":""},"","","","","",null,{"$f":"IF($O93<>\"\",VLOOKUP(Input!S93,Tables!$L$5:$M$9,2,FALSE), \"\")","v":""},null,"","","",null,null,null,null,null,null,null,null,null,null,null,null,"00:00:00",{"$f":"MIN(AC93,AD93)/Tables!B$3","v":0},{"$f":"(((DATE(YEAR(BK93)+Tables!$B$3,MONTH(BK93),DAY(BK93))-BK93)*BL93))","v":0},"00:00:00","00:00:00","00:00:00",0,"2012-01-01",0,{"$f":"1","v":1},0,-40909,null,null,null,null,null,null,null,null,"",""]
[null,null,null,null,null,null,null,null,null,null,null,null,null,null,null,null,null,null,null,null,"",{"$f":"IF(U94<>\"\", U94*$G$2*Tables!$B$1,\"\")","v":""},null,{"$f":"IF(E94<>\"\", CONCATENATE(E94,\"-\",G94),\"\")","v":""},{"$f":"IF($E94<>\"\",VLOOKUP(Input!$X94,Tables!$E$5:$G$200,2,FALSE), \"\")","v":""},{"$f":"IF($F94=\"\",\"\", VLOOKUP(Input!$X94,Tables!$E$5:$G$200,3,FALSE))","v":""},"","",null,null,{"$f":"IF(W94=\"\",\"\",W94)","v":""},null,{"$f":"IF($E94<>\"\",VLOOKUP(Input!J94,Tables!$L$5:$M$9,2,FALSE), \"\")","v":""},null,"",null,{"$f":"IF(N94<>\"\", CONCATENATE(N94,\"-\",P94),\"\")","v":""},{"$f":"IF($N94<>\"\",VLOOKUP(Input!$AK94,Tables!$E$5:$G$200,2,FALSE), \"\")","v":""},{"$f":"IF($O94=\"\",\"\",VLOOKUP(Input!$AK94,Tables!$E$5:$G$200,3,FALSE))","v":""},"","",{"$f":"IF(AC94<>\"\",AC94,\"\")","v":""},{"$f":"IF(AD94<>\"\",AD94,\"\")","v":""},{"$f":"IF(W94=\"\",\"\",W94)","v":""},null,{"$f":"IF($O94<>\"\",VLOOKUP(Input!S94,Tables!$L$5:$M$9,2,FALSE), \"\")","v":""},null,"","","",null,null,null,null,null,null,null,null,null,null,null,null,"00:00:00",{"$f":"MIN(AC94,AD94)/Tables!B$3","v":0},{"$f":"(((DATE(YEAR(BK94)+Tables!$B$3,MONTH(BK94),DAY(BK94))-BK94)*BL94))","v":0},"00:00:00","00:00:00","00:00:00",0,"2012-01-01",0,{"$f":"1","v":1},0,-40909,null,null,null,null,null,null,null,null,"",""]
[null,null,null,null,null,null,null,null,null,null,null,null,null,null,null,null,null,null,null,null,"",{"$f":"IF(U95<>\"\", U95*$G$2*Tables!$B$1,\"\")","v":""},null,"",{"$f":"IF($E95<>\"\",VLOOKUP(Input!$X95,Tables!$E$5:$G$200,2,FALSE), \"\")","v":""},{"$f":"IF($F95=\"\",\"\", VLOOKUP(Input!$X95,Tables!$E$5:$G$200,3,FALSE))","v":""},"","",null,null,"",null,{"$f":"IF($E95<>\"\",VLOOKUP(Input!J95,Tables!$L$5:$M$9,2,FALSE), \"\")","v":""},null,"",null,"",{"$f":"IF($N95<>\"\",VLOOKUP(Input!$AK95,Tables!$E$5:$G$200,2,FALSE), \"\")","v":""},{"$f":"IF($O95=\"\",\"\",VLOOKUP(Input!$AK95,Tables!$E$5:$G$200,3,FALSE))","v":""},"","","","","",null,{"$f":"IF($O95<>\"\",VLOOKUP(Input!S95,Tables!$L$5:$M$9,2,FALSE), \"\")","v":""},null,"","","",null,null,null,null,null,null,null,null,null,null,null,null,"00:00:00",{"$f":"MIN(AC95,AD95)/Tables!B$3","v":0},{"$f":"(((DATE(YEAR(BK95)+Tables!$B$3,MONTH(BK95),DAY(BK95))-BK95)*BL95))","v":0},"00:00:00","00:00:00","00:00:00",0,"2012-01-01",0,{"$f":"1","v":1},0,-40909,null,null,null,null,null,null,null,null,"",""]
[null,null,null,null,null,null,null,null,null,null,null,null,null,null,null,null,null,null,null,null,"",{"$f":"IF(U96<>\"\", U96*$G$2*Tables!$B$1,\"\")","v":""},null,"",{"$f":"IF($E96<>\"\",VLOOKUP(Input!$X96,Tables!$E$5:$G$200,2,FALSE), \"\")","v":""},{"$f":"IF($F96=\"\",\"\", VLOOKUP(Input!$X96,Tables!$E$5:$G$200,3,FALSE))","v":""},"","",null,null,"",null,{"$f":"IF($E96<>\"\",VLOOKUP(Input!J96,Tables!$L$5:$M$9,2,FALSE), \"\")","v":""},null,"",null,"",{"$f":"IF($N96<>\"\",VLOOKUP(Input!$AK96,Tables!$E$5:$G$200,2,FALSE), \"\")","v":""},{"$f":"IF($O96=\"\",\"\",VLOOKUP(Input!$AK96,Tables!$E$5:$G$200,3,FALSE))","v":""},"","","","","",null,{"$f":"IF($O96<>\"\",VLOOKUP(Input!S96,Tables!$L$5:$M$9,2,FALSE), \"\")","v":""},null,"","","",null,null,null,null,null,null,null,null,null,null,null,null,"00:00:00",{"$f":"MIN(AC96,AD96)/Tables!B$3","v":0},{"$f":"(((DATE(YEAR(BK96)+Tables!$B$3,MONTH(BK96),DAY(BK96))-BK96)*BL96))","v":0},"00:00:00","00:00:00","00:00:00",0,"2012-01-01",0,{"$f":"1","v":1},0,-40909,null,null,null,null,null,null,null,null,"",""]
[null,null,null,null,null,null,null,null,null,null,null,null,null,null,null,null,null,null,null,null,"",{"$f":"IF(U97<>\"\", U97*$G$2*Tables!$B$1,\"\")","v":""},null,"",{"$f":"IF($E97<>\"\",VLOOKUP(Input!$X97,Tables!$E$5:$G$200,2,FALSE), \"\")","v":""},{"$f":"IF($F97=\"\",\"\", VLOOKUP(Input!$X97,Tables!$E$5:$G$200,3,FALSE))","v":""},"","",null,null,"",null,{"$f":"IF($E97<>\"\",VLOOKUP(Input!J97,Tables!$L$5:$M$9,2,FALSE), \"\")","v":""},null,"",null,"",{"$f":"IF($N97<>\"\",VLOOKUP(Input!$AK97,Tables!$E$5:$G$200,2,FALSE), \"\")","v":""},{"$f":"IF($O97=\"\",\"\",VLOOKUP(Input!$AK97,Tables!$E$5:$G$200,3,FALSE))","v":""},"","","","","",null,{"$f":"IF($O97<>\"\",VLOOKUP(Input!S97,Tables!$L$5:$M$9,2,FALSE), \"\")","v":""},null,"","","",null,null,null,null,null,null,null,null,null,null,null,null,"00:00:00",{"$f":"MIN(AC97,AD97)/Tables!B$3","v":0},{"$f":"(((DATE(YEAR(BK97)+Tables!$B$3,MONTH(BK97),DAY(BK97))-BK97)*BL97))","v":0},"00:00:00","00:00:00","00:00:00",0,"2012-01-01",0,{"$f":"1","v":1},0,-40909,null,null,null,null,null,null,null,null,"",""]
[null,null,null,null,null,null,null,null,null,null,null,null,null,null,null,null,null,null,null,null,"",{"$f":"IF(U98<>\"\", U98*$G$2*Tables!$B$1,\"\")","v":""},null,"",{"$f":"IF($E98<>\"\",VLOOKUP(Input!$X98,Tables!$E$5:$G$200,2,FALSE), \"\")","v":""},{"$f":"IF($F98=\"\",\"\", VLOOKUP(Input!$X98,Tables!$E$5:$G$200,3,FALSE))","v":""},"","",null,null,"",null,{"$f":"IF($E98<>\"\",VLOOKUP(Input!J98,Tables!$L$5:$M$9,2,FALSE), \"\")","v":""},null,"",null,"",{"$f":"IF($N98<>\"\",VLOOKUP(Input!$AK98,Tables!$E$5:$G$200,2,FALSE), \"\")","v":""},{"$f":"IF($O98=\"\",\"\",VLOOKUP(Input!$AK98,Tables!$E$5:$G$200,3,FALSE))","v":""},"","","","","",null,{"$f":"IF($O98<>\"\",VLOOKUP(Input!S98,Tables!$L$5:$M$9,2,FALSE), \"\")","v":""},null,"","","",null,null,null,null,null,null,null,null,null,null,null,null,"00:00:00",{"$f":"MIN(AC98,AD98)/Tables!B$3","v":0},{"$f":"(((DATE(YEAR(BK98)+Tables!$B$3,MONTH(BK98),DAY(BK98))-BK98)*BL98))","v":0},"00:00:00","00:00:00","00:00:00",0,"2012-01-01",0,{"$f":"1","v":1},0,-40909,null,null,null,null,null,null,null,null,"",""]
[null,null,null,null,null,null,null,null,null,null,null,null,null,null,null,null,null,null,null,null,"",{"$f":"IF(U99<>\"\", U99*$G$2*Tables!$B$1,\"\")","v":""},null,"",{"$f":"IF($E99<>\"\",VLOOKUP(Input!$X99,Tables!$E$5:$G$200,2,FALSE), \"\")","v":""},{"$f":"IF($F99=\"\",\"\", VLOOKUP(Input!$X99,Tables!$E$5:$G$200,3,FALSE))","v":""},"","",null,null,"",null,{"$f":"IF($E99<>\"\",VLOOKUP(Input!J99,Tables!$L$5:$M$6,2,FALSE), \"\")","v":""},null,"",null,"",{"$f":"IF($N99<>\"\",VLOOKUP(Input!$AK99,Tables!$E$5:$G$200,2,FALSE), \"\")","v":""},{"$f":"IF($O99=\"\",\"\",VLOOKUP(Input!$AK99,Tables!$E$5:$G$200,3,FALSE))","v":""},"","","","","",null,{"$f":"IF($O99<>\"\",VLOOKUP(Input!S99,Tables!$L$5:$M$9,2,FALSE), \"\")","v":""},null,"","","",null,null,null,null,null,null,null,null,null,null,null,null,"00:00:00",{"$f":"MIN(AC99,AD99)/Tables!B$3","v":0},{"$f":"(((DATE(YEAR(BK99)+Tables!$B$3,MONTH(BK99),DAY(BK99))-BK99)*BL99))","v":0},"00:00:00","00:00:00","00:00:00",0,"2012-01-01",0,{"$f":"1","v":1},0,-40909,null,null,null,null,null,null,null,null,"",""]
[null,null,null,null,null,null,null,null,null,null,null,null,null,null,null,null,null,null,null,null,{"$f":"IF(AW100<>\"\",AW100, \"\")","v":""},{"$f":"IF(U100<>\"\", U100*$G$2*Tables!$B$1,\"\")","v":""},null,"",{"$f":"IF($E100<>\"\",VLOOKUP(Input!$X100,Tables!$E$5:$G$200,2,FALSE), \"\")","v":""},{"$f":"IF($F100=\"\",\"\", VLOOKUP(Input!$X100,Tables!$E$5:$G$200,3,FALSE))","v":""},null,null,null,null,null,null,{"$f":"IF($E100<>\"\",VLOOKUP(Input!J100,Tables!$L$5:$M$6,2,FALSE), \"\")","v":""},null,null,null,null,{"$f":"IF($N100<>\"\",VLOOKUP(Input!$AK100,Tables!$E$5:$G$200,2,FALSE), \"\")","v":""},{"$f":"IF($O100=\"\",\"\",VLOOKUP(Input!$AK100,Tables!$E$5:$G$200,3,FALSE))","v":""},null,null,null,null,null,null,{"$f":"IF($O100<>\"\",VLOOKUP(Input!S100,Tables!$L$5:$M$9,2,FALSE), \"\")","v":""},null,null,null,"",null,null,null,null,null,null,null,null,null,null,null,null,null,null,null,null,null,null,null,null,null,null,null,null,null,null,null,null,null,null,null,null,"",""]
[null,null,null,null,null,null,null,null,null,null,null,null,null,null,null,null,null,null,null,null,"",{"$f":"IF(U101<>\"\", U101*$G$2*Tables!$B$1,\"\")","v":""},null,null,{"$f":"IF($E101<>\"\",VLOOKUP(Input!$X101,Tables!$E$5:$G$200,2,FALSE), \"\")","v":""},{"$f":"IF($F101=\"\",\"\", VLOOKUP(Input!$X101,Tables!$E$5:$G$200,3,FALSE))","v":""},null,null,null,null,null,null,{"$f":"IF($E101<>\"\",VLOOKUP(Input!J101,Tables!$L$5:$M$6,2,FALSE), \"\")","v":""},null,null,null,null,{"$f":"IF($N101<>\"\",VLOOKUP(Input!$AK101,Tables!$E$5:$G$200,2,FALSE), \"\")","v":""},{"$f":"IF($O101=\"\",\"\",VLOOKUP(Input!$AK101,Tables!$E$5:$G$200,3,FALSE))","v":""},null,null,null,null,null,null,null,null,null,null,"",null,null,null,null,null,null,null,null,null,null,null,null,null,null,null,null,null,null,null,null,null,null,null,null,null,null,null,null,null,null,null,null,"",""]
[null,null,null,null,null,null,null,null,null,null,null,null,null,null,null,null,null,null,null,null,"",{"$f":"IF(U102<>\"\", U102*$G$2*Tables!$B$1,\"\")","v":""},null,null,{"$f":"IF($E102<>\"\",VLOOKUP(Input!$X102,Tables!$E$5:$G$200,2,FALSE), \"\")","v":""},{"$f":"IF($F102=\"\",\"\", VLOOKUP(Input!$X102,Tables!$E$5:$G$200,3,FALSE))","v":""},null,null,null,null,null,null,null,null,null,null,null,{"$f":"IF($N102<>\"\",VLOOKUP(Input!$AK102,Tables!$E$5:$G$200,2,FALSE), \"\")","v":""},{"$f":"IF($O102=\"\",\"\",VLOOKUP(Input!$AK102,Tables!$E$5:$G$200,3,FALSE))","v":""},null,null,null,null,null,null,null,null,null,null,"",null,null,null,null,null,null,null,null,null,null,null,null,null,null,null,null,null,null,null,null,null,null,null,null,null,null,null,null,null,null,null,null,"",""]
[null,null,null,null,null,null,null,null,null,null,null,null,null,null,null,null,null,null,null,null,"",{"$f":"IF(U103<>\"\", U103*$G$2*Tables!$B$1,\"\")","v":""},null,null,{"$f":"IF($E103<>\"\",VLOOKUP(Input!$X103,Tables!$E$5:$G$200,2,FALSE), \"\")","v":""},{"$f":"IF($F103=\"\",\"\", VLOOKUP(Input!$X103,Tables!$E$5:$G$200,3,FALSE))","v":""},null,null,null,null,null,null,null,null,null,null,null,{"$f":"IF($N103<>\"\",VLOOKUP(Input!$AK103,Tables!$E$5:$G$200,2,FALSE), \"\")","v":""},{"$f":"IF($O103=\"\",\"\",VLOOKUP(Input!$AK103,Tables!$E$5:$G$200,3,FALSE))","v":""},null,null,null,null,null,null,null,null,null,null,{"$f":"IF($O103<>\"\",AW103*G$2,\"\")","v":""},null,null,null,null,null,null,null,null,null,null,null,null,null,null,null,null,null,null,null,null,null,null,null,null,null,null,null,null,null,null,null,null,"",""]
[null,null,null,null,null,null,null,null,null,null,null,null,null,null,null,null,null,null,null,null,"",{"$f":"IF(U104<>\"\", U104*$G$2*Tables!$B$1,\"\")","v":""},null,null,{"$f":"IF($E104<>\"\",VLOOKUP(Input!$X104,Tables!$E$5:$G$200,2,FALSE), \"\")","v":""},{"$f":"IF($F104=\"\",\"\", VLOOKUP(Input!$X104,Tables!$E$5:$G$200,3,FALSE))","v":""},null,null,null,null,null,null,null,null,null,null,null,{"$f":"IF($N104<>\"\",VLOOKUP(Input!$AK104,Tables!$E$5:$G$200,2,FALSE), \"\")","v":""},{"$f":"IF($O104=\"\",\"\",VLOOKUP(Input!$AK104,Tables!$E$5:$G$200,3,FALSE))","v":""},null,null,null,null,null,null,null,null,null,null,"",null,null,null,null,null,null,null,null,null,null,null,null,null,null,null,null,null,null,null,null,null,null,null,null,null,null,null,null,null,null,null,null,"",""]
[null,null,null,null,null,null,null,null,null,null,null,null,null,null,null,null,null,null,null,null,"",{"$f":"IF(U105<>\"\", U105*$G$2*Tables!$B$1,\"\")","v":""},null,null,{"$f":"IF($E105<>\"\",VLOOKUP(Input!$X105,Tables!$E$5:$G$200,2,FALSE), \"\")","v":""},{"$f":"IF($F105=\"\",\"\", VLOOKUP(Input!$X105,Tables!$E$5:$G$200,3,FALSE))","v":""},null,null,null,null,null,null,null,null,null,null,null,{"$f":"IF($N105<>\"\",VLOOKUP(Input!$AK105,Tables!$E$5:$G$200,2,FALSE), \"\")","v":""},{"$f":"IF($O105=\"\",\"\",VLOOKUP(Input!$AK105,Tables!$E$5:$G$200,3,FALSE))","v":""},null,null,null,null,null,null,null,null,null,null,"",null,null,null,null,null,null,null,null,null,null,null,null,null,null,null,null,null,null,null,null,null,null,null,null,null,null,null,null,null,null,null,null,"",""]
[null,null,null,null,null,null,null,null,null,null,null,null,null,null,null,null,null,null,null,null,"",{"$f":"IF(U106<>\"\", U106*$G$2*Tables!$B$1,\"\")","v":""},null,null,null,null,null,null,null,null,null,null,null,null,null,null,null,{"$f":"IF($N106<>\"\",VLOOKUP(Input!$AK106,Tables!$E$5:$G$200,2,FALSE), \"\")","v":""},{"$f":"IF($O106=\"\",\"\",VLOOKUP(Input!$AK106,Tables!$E$5:$G$200,3,FALSE))","v":""},null,null,null,null,null,null,null,null,null,null,""]
[null,null,null,null,null,null,null,null,null,null,null,null,null,null,null,null,null,null,null,null,"",{"$f":"IF(U107<>\"\", U107*$G$2*Tables!$B$1,\"\")","v":""},null,null,null,null,null,null,null,null,null,null,null,null,null,null,null,{"$f":"IF($N107<>\"\",VLOOKUP(Input!$AK107,Tables!$E$5:$G$200,2,FALSE), \"\")","v":""},{"$f":"IF($O107=\"\",\"\",VLOOKUP(Input!$AK107,Tables!$E$5:$G$200,3,FALSE))","v":""},null,null,null,null,null,null,null,null,null,null,""]
[null,null,null,null,null,null,null,null,null,null,null,null,null,null,null,null,null,null,null,null,"",null,null,null,null,null,null,null,null,null,null,null,null,null,null,null,null,{"$f":"IF($N108<>\"\",VLOOKUP(Input!$AK108,Tables!$E$5:$G$200,2,FALSE), \"\")","v":""},{"$f":"IF($O108=\"\",\"\",VLOOKUP(Input!$AK108,Tables!$E$5:$G$200,3,FALSE))","v":""}]

{"sheet":"Tables (3)","index":2,"n_rows":98,"n_cols":21,"rows_kept":98,"cut":false,"hidden":true,"merged":[]}
["Certificate conversion factor",1.06,"t CO2-e / MWh",null,0,"SelectedArea",null,"Lifetimeform open?"]
["Site Annual Operating Hours",4500,"hours per annum",null,10,"NextAvailRow"]
["Asset Lifetime",12,"years",null,"Lamp circuit power equation","y=mX+C"]
["Lamp type",null,null,null,"Lamp+ballast/transformer type","M value","C value",null,"Control System","Factor",null,"Airconditioned space","Factor",null,"T8 - T12 ballasts","Approved lamp type 1",null,null,null,"BCA Classification","AOH"]
["T8 or T12",null,null,null,"T8 or T12-D",1,12,null,"none",1,null,"Yes",1.3,null,"D",null,null,null,null,"Class 2 (Common Area)",7000]
["T5",null,null,null,"T8 or T12-C",1,10,null,"Occupancy sensor",0.7,null,"No",1,null,"C",null,null,null,null,"Class 3 (Common Area)",7000]
["CFLn",null,null,null,"T8 or T12-B2",1,8,null,"Daylight linked control",0.7,null,null,null,null,"B2",null,null,null,null,"Class 3 (Other than Common Areas)",3000]
["Circular fluorescent",null,null,null,"T8 or T12-B1",1,6,null,"Programmable dimming",0.85,null,null,null,null,"B1",null,null,null,null,"Class 4",3000]
["Metal halide",null,null,null,"T8 or T12-A3",1,2,null,"Manual dimming",0.9,null,null,null,null,"A3",null,null,null,null,"Class 5",3000]
["Mercury Vapour",null,null,null,"T8 or T12-A2",1,0,null,null,null,null,null,null,null,"A2",null,null,null,null,"Class 6",5000]
["High pressure sodium",null,null,null,"T8 or T12-A1",1,2,null,null,null,null,null,null,null,"A1",null,null,null,null,"Class 7",5000]
["Tungsten halogen-240V",null,null,null,"T5-A3",1.1299999999999999,2.5,null,null,null,null,null,null,null,null,null,null,null,null,"Class 7(a) (Carparks)",7000]
["CFLi",null,null,null,"T5-A2",1.08,1.5,null,null,null,null,null,null,null,"T5",null,null,null,null,"Class 8 (Other than ANZIC Code C, Manufacturing)",3000]
["Tungsten halogen-ELV",null,null,null,"T5-A1",1.1299999999999999,2.5,null,null,null,null,null,null,null,"A3",null,null,null,null,"Class 8 (ANZIC Code C, Manufacturing)",5000]
["LED lamp only",null,null,null,"CFLn-D",1,11,null,null,null,null,null,null,null,"A2",null,null,null,null,"Class 9a or Class 9c",6000]
["LED lamp and driver",null,null,null,"CFLn-C",1,9,null,null,null,null,null,null,null,"A1",null,null,null,null,"Class 9b",2000]
["LED integrated ballast",null,null,null,"CFLn-B2",1,7,null,null,null,null,null,null,null,null,null,null,null,null,"Class 10 (b)",1000]
["Induction lamp",null,null,null,"CFLn-B1",1,5]
["T5 adaptor kit",null,null,null,"CFLn-A3",1,3,null,null,null,null,null,null,null,"CFLn"]
["LED Tube",null,null,null,"CFLn-A2",1,1,null,null,null,null,null,null,null,"D"]
["Specific LCP request",null,null,null,"CFLn-A1",1,3,null,null,null,null,null,null,null,"C"]
["Existing ELT",null,null,null,"Circular fluorescent-D",1,12,null,null,null,null,null,null,null,"B2"]
["None",null,null,null,"Circular fluorescent-C",1,10,null,null,null,null,null,null,null,"B1"]
[null,null,null,null,"Circular fluorescent-B3",1,8,null,null,null,null,null,null,null,"A3"]
[null,null,null,null,"Circular fluorescent-B2",1,6,null,null,null,null,null,null,null,"A2"]
["Existing ELT",null,null,null,"Circular fluorescent-A3",1,2,null,null,null,null,null,null,null,"A1"]
["None",null,null,null,"Circular fluorescent-A2",1,0]
[null,null,null,null,"Circular fluorescent-A1",1,2,null,null,null,null,null,null,null,"Circular fluorescent"]
[null,null,null,null,"Metal halide-Magnetic(reactor)",1.0456000000000001,14,null,null,null,null,null,null,null,"D"]
[null,null,null,null,"Metal halide-Magnetic(constant wattage)",1.071,22,null,null,null,null,null,null,null,"C"]
[null,null,null,null,"Metal halide-Electronic",1.0960000000000001,0.9,null,null,null,null,null,null,null,"B3"]
[null,null,null,null,"Mercury Vapour-Magnetic",1.0329999999999999,11,null,null,null,null,null,null,null,"B2"]
[null,null,null,null,"High pressure sodium-Magnetic",1.0509999999999999,13,null,null,null,null,null,null,null,"A3"]
[null,null,null,null,"Tungsten halogen-ELV-Magnetic",1.25,0,null,null,null,null,null,null,null,"A2"]
[null,null,null,null,"Tungsten halogen-ELV-Electronic",1.0751999999999999,0,null,null,null,null,null,null,null,"A1"]
[null,null,null,null,"CFLi-none",1,0]
[null,null,null,null,"Tungsten halogen-240V-none",1,0,null,null,null,null,null,null,null,"Metal halide"]
[null,null,null,null,"LED lamp only-Magnetic",1.25,0,null,null,null,null,null,null,null,"Magnetic(reactor)"]
[null,null,null,null,"LED lamp only-Electronic",1.0751999999999999,0,null,null,null,null,null,null,null,"Magnetic(constant wattage)"]
[null,null,null,null,"LED lamp and driver-External",1,0,null,null,null,null,null,null,null,"Electronic"]
[null,null,null,null,"LED integrated ballast-Integrated",1,0]
[null,null,null,null,"Induction lamp-Integrated",1,0,null,null,null,null,null,null,null,"Mercury Vapour"]
[null,null,null,null,"T5 adaptor kit-Integrated",1,0,null,null,null,null,null,null,null,"Magnetic"]
[null,null,null,null,"LED Tube-Integrated",1,0]
[null,null,null,null,"Specific LCP request-Integrated",1,0," ",null,null,null,null,null,null,"High pressure sodium"]
[null,null,null,null,"Specific LCP request-External-Please specify model",1,0,null,null,null,null,null,null,null,"Magnetic"]
[null,null,null,null,"Specific LCP request-Electronic-lamp only",1.0751999999999999,0]
[null,null,null,null,"Specific LCP request-Magnetic-lamp only",1.25,0,null,null,null,null,null,null,null,"Tungsten halogen-240V"]
[null,null,null,null,"Existing ELT-Not Applicable",1,0,null,null,null,null,null,null,null,"none"]
[null,null,null,null,"None-Not Applicable",0,0]
[null,null,null,null,null,null,null,null,null,null,null,null,null,null,"CFLi"]
[null,null,null,null,null,null,null,null,null,null,null,null,null,null,"none"]
[]
[null,null,null,null,null,null,null,null,null,null,null,null,null,null,"Tungsten halogen-ELV"]
[null,null,null,null,null,null,null,null,null,null,null,null,null,null,"Magnetic"]
[null,null,null,null,null,null,null,null,null,null,null,null,null,null,"Electronic"]
[]
[null,null,null,null,null,null,null,null,null,null,null,null,null,null,"Emerging Technology"]
[null,null,null,null,null,null,null,null,null,null,null,null,null,null,"Integrated"]
[null,null,null,null,null,null,null,null,null,null,null,null,null,null,"Electronic "]
[null,null,null,null,null,null,null,null,null,null,null,null,null,null,"Magnetic"]
[null,null,null,null,null,null,null,null,null,null,null,null,null,null,"None"]
[]
[]
[null,null,null,null,null,null,null,null,null,null,null,null,null,null,"LED lamp only"]
[null,null,null,null,null,null,null,null,null,null,null,null,null,null,"Magnetic"]
[null,null,null,null,null,null,null,null,null,null,null,null,null,null,"Electronic"]
[]
[null,null,null,null,null,null,null,null,null,null,null,null,null,null,"LED lamp and driver"]
[null,null,null,null,null,null,null,null,null,null,null,null,null,null,"External"]
[]
[]
[null,null,null,null,null,null,null,null,null,null,null,null,null,null,"LED integrated ballast"]
[null,null,null,null,null,null,null,null,null,null,null,null,null,null,"Integrated"]
[]
[null,null,null,null,null,null,null,null,null,null,null,null,null,null,"Induction lamp"]
[null,null,null,null,null,null,null,null,null,null,null,null,null,null,"Integrated"]
[]
[null,null,null,null,null,null,null,null,null,null,null,null,null,null,"T5 adaptor kit"]
[null,null,null,null,null,null,null,null,null,null,null,null,null,null,"Integrated"]
[]
[null,null,null,null,null,null,null,null,null,null,null,null,null,null,"LED TUBE"]
[null,null,null,null,null,null,null,null,null,null,null,null,null,null,"Integrated"]
[]
[null,null,null,null,null,null,null,null,null,null,null,null,null,null,"Other emerging lighting technology"]
[null,null,null,null,null,null,null,null,null,null,null,null,null,null,"Integrated"]
[]
[null,null,null,null,null,null,null,null,null,null,null,null,null,null,"Specific LCP request "]
[null,null,null,null,null,null,null,null,null,null,null,null,null,null,"Integrated"]
[null,null,null,null,null,null,null,null,null,null,null,null,null,null,"External-Please specify model"]
[null,null,null,null,null,null,null,null,null,null,null,null,null,null,"Electronic-lamp only"]
[null,null,null,null,null,null,null,null,null,null,null,null,null,null,"Magnetic-lamp only"]
[]
[null,null,null,null,null,null,null,null,null,null,null,null,null,null,"Existing ELT"]
[null,null,null,null,null,null,null,null,null,null,null,null,null,null,"Not Applicable"]
[]
[null,null,null,null,null,null,null,null,null,null,null,null,null,null,"None"]
[null,null,null,null,null,null,null,null,null,null,null,null,null,null,"Not Applicable"]

{"sheet":"Tables","index":3,"n_rows":113,"n_cols":31,"rows_kept":113,"cut":false,"hidden":false,"merged":[]}
["Certificate conversion factor",1.06,"t CO2-e / MWh",null,7,"SelectedArea",null,"Lifetimeform open?",null,null,null,null,null,null,null,null,null,null,null,null,null,null,null,null,null,null,null,null,"Control System only - Max lifetime",5,"years"]
["Site Annual Operating Hours",3000,"hours per annum",null,7,"NextAvailRow",false,"Open UPGRADEForm in EditMode"]
["Asset Lifetime",10,"years",null,"Lamp circuit power equation","y=mX+C"]
["Lamp type",null,null,null,"Lamp+ballast/transformer type","M value","C value",null,"Control System","Factor",null,"Airconditioned space","Factor",null,"T8 - T12 ballasts","Approved lamp type 1",null,null,null,"BCA Space Type (A10.2)","AOH","Building/Space Group",null,"Starting Postcode ","Ending Postcode","Regional Network Factor",null,null,"Group","Max Asset Lifetime\n(Regional Site)","Max Asset Lifetime\n(Other Site)"]
["T8 or T12 Linear",null,null,null,"T8 or T12 Linear-EEI D",1,12,null,"none",1,null,"Air conditioned (refrigerant based AC)",1.07,null,"EEI D",null,null,null,null,"Auditorium, church and public hall",2000,"A (Others)",null,2311,2312,1.03,null,null,"A (Others)",10,7.3]
["T5 Linear or T5 Circular",null,null,null,"T8 or T12 Linear-EEI C",1,10,null,"Occupancy sensor",0.7,null,"Data Centre (refrigerant based AC)",1.3,null,"EEI C",null,null,null,null,"Board room and conference room",3000,"B (Office)",null,2321,2321,1.03,null,null,"B (Office)",10,7.4]
["CFLn",null,null,null,"T8 or T12 Linear-EEI B2",1,8,null,"Daylight linked control",0.7,null,"Refrigerated room",1.3,null,"EEI B2",null,null,null,null,"Carpark - general (undercover)",7000,"C (Industrial)",null,2324,2324,1.03,null,null,"C (Industrial)",11.7,11.7]
["T9 or T12 Circular fluorescent",null,null,null,"T8 or T12 Linear-EEI B1",1,6,null,"Programmable dimming",0.85,null,"Other airconditioning (non-refrigerant based)",1,null,"EEI B1",null,null,null,null,"Carpark - entry zone",7000,"C (Industrial)",null,2329,2329,1.03,null,null,"D (Retail)",10,7.4]
["Metal halide",null,null,null,"T8 or T12 Linear-EEI A3",1,2,null,"Manual dimming",0.9,null,"No Air conditioning",1,null,"EEI A3",null,null,null,null,"Carpark - general (open air)",4500,"C (Industrial)",null,2338,2490,1.03,null,null,"E (Public)",12,12]
["Mercury Vapour",null,null,null,"T8 or T12 Linear-EEI A2",1,0,null,"Specialised - Occupancy Sensor 1",0.55000000000000004,null,null,null,null,"EEI A2",null,null,null,null,"Common rooms, spaces, corridors in a Class 2 building (including stairways and lift cars)",7000,"A (Others)",null,2536,2537,1.03]
["High pressure sodium",null,null,null,"T8 or T12 Linear-EEI A1",1,2,null,"Specialised - Occupancy Sensor 2",0.3,null,null,null,null,"EEI A1",null,null,null,null,"Control room, switch room, and the like – intermittent monitoring and constant monitoring",null,null,null,2545,2551,1.03]
["Tungsten halogen (240V)",null,null,null,"T5 Linear or T5 Circular-EEI A3",1.1299999999999999,2.5,null,"Specialised - Occupancy Sensor 3",0.15,null,null,null,null,null,null,null,null,null,"Corridors",null,null,null,2579,2594,1.03]
["CFLi",null,null,null,"T5 Linear or T5 Circular-EEI A2",1.08,1.5,null,"Specialised - Occupancy Sensor 4",0.25,null,null,null,null,"T5",null,null,null,null,"Courtroom",2000,"A (Others)",null,2611,2611,1.03]
["Tungsten halogen (ELV)",null,null,null,"T5 Linear or T5 Circular-EEI A1",1.1299999999999999,2.5,null,null,null,null,null,null,null,"EEI A3",null,null,null,null,"Dormitory of a Class 3 building used for sleeping or sleeping and study",3000,"A (Others)",null,2618,2739,1.03]
["LED Lamp only - ELV",null,null,null,"CFLn-EEI D",1,11,null,null,null,null,null,null,null,"EEI A2",null,null,null,null,"Entry lobby from outside the building",null,null,null,2787,2787,1.03]
["LED Lamp only - 240V Self Ballasted",null,null,null,"CFLn-EEI C",1,9,null,null,null,null,null,null,null,"EEI A1",null,null,null,null,"Health Care",6000,"A (Others)",null,2791,2844,1.03]
["LED Lamp and Driver",null,null,null,"CFLn-EEI B2",1,7,null,null,null,null,null,null,null,null,null,null,null,null,"Health and fitness centres and gymnasia operations",5100,"A (Others)",null,2850,2880,1.03]
["LED Luminaire (Fixed Type)",null,null,null,"CFLn-EEI B1",1,5,null,null,null,null,null,null,null,null,null,null,null,null,"Kitchen and food preparation area",null,null,null,3644,3644,1.03]
["LED Luminaire (Floodlight)",null,null,null,"CFLn-EEI A3",1,3,null,null,null,null,null,null,null,"CFLn",null,null,null,null,"Laboratory ",3000,"A (Others)",null,3691,3691,1.03]
["LED Luminaire (Recessed)",null,null,null,"CFLn-EEI A2",1,1,null,null,null,null,null,null,null,"EEI D",null,null,null,null,"Library",3000,"A (Others)",null,3707,3707,1.03]
["LED Luminaire (High/Low Bay)",null,null,null,"CFLn-EEI A1",1,3,null,null,null,null,null,null,null,"EEI C",null,null,null,null,"Lounge Area for communal use in a Class 3 building or Class 9c aged care building",7000,"A (Others)",null,4375,4375,1.03]
["LED Luminaire (Streetlight)",null,null,null,"T9 or T12 Circular fluorescent-EEI D",1,12,null,null,null,null,null,null,null,"EEI B2",null,null,null,null,"Museum and gallery - circulation, cleaning and service lighting",2000,"A (Others)",null,4377,4377,1.03]
["LED Luminaire (Emergency Lighting)",null,null,null,"T9 or T12 Circular fluorescent-EEI C",1,10,null,null,null,null,null,null,null,"EEI B1",null,null,null,null,"Office",3000,"B (Office)",null,4380,4380,1.03]
["LED Luminaire (Hospital Use)",null,null,null,"T9 or T12 Circular fluorescent-EEI B2",1,8,null,null,null,null,null,null,null,"EEI A3",null,null,null,null,"Plant Room",null,null,null,4383,4383,1.03]
["Induction Luminaire",null,null,null,"T9 or T12 Circular fluorescent-EEI B1",1,6,null,null,null,null,null,null,null,"EEI A2",null,null,null,null,"Restaurant, café, bar, hotel lounge (Division H)",5000,"D (Retail)",null,4385,4385,1.03]
["Existing ELT",null,null,null,"T9 or T12 Circular fluorescent-EEI A3",1,2,null,null,null,null,null,null,null,"EEI A1",null,null,null,null,"Restaurant, café, bar, hotel lounge (Division R)",2000,"D (Retail)"]
["None",null,null,null,"T9 or T12 Circular fluorescent-EEI A2",1,0,null,null,null,null,null,null,null,null,null,null,null,null,"Retail space including a museum and gallery whose purpose is the sale of objects",5000,"D (Retail)"]
["Specific LCP request",null,null,null,"T9 or T12 Circular fluorescent-EEI A1",1,2,null,null,null,null,null,null,null,"Circular fluorescent",null,null,null,null,"School - general purpose learning areas and tutorial rooms",3000,"A (Others)"]
["Infra Red Coated halogen (ELV)",null,null,null,"Metal halide-Magnetic(reactor)",1.05,14,null,null,null,null,null,null,null,"EEI D",null,null,null,null,"Sole-occupancy unit of a Class 3 or 9c building",3000,"A (Others)"]
["Modified Luminaire (LED Linear Lamp)",null,null,null,"Metal halide-Magnetic(constant wattage)",1.07,22,null,null,null,null,null,null,null,"EEI C",null,null,null,null,"Storage",5000,"A (Others)"]
["LED Luminaire (Linear Lamp)",null,null,null,"Metal halide-Electronic(non-integrated)",1.1000000000000001,0.9,null,null,null,null,null,null,null,"EEI B2",null,null,null,null,"Service area, cleaner's room and the like"]
["Other Emerging Lighting Technology",null,null,null,"Mercury Vapour-Magnetic (non-integrated)",1.03,11,null,null,null,null,null,null,null,"EEI B1",null,null,null,null,"Toilet, locker room, staff room, rest room and the like"]
["Roads and Public Spaces",null,null,null,"High pressure sodium-Magnetic",1.05,13,null,null,null,null,null,null,null,"EEI A3",null,null,null,null,"Wholesale storage and display area with a vertical illuminance target of 160 lx (including distribution centres)",5000,"C (Industrial)"]
["AEMO-Mercury Vapour",null,null,null,"Tungsten halogen (ELV)-Magnetic",1.25,0,null,null,null,null,null,null,null,"EEI A2",null,null,null,null,"Un-Switched Maintained Emergency Luminaire",8500]
["AEMO-High Pressure Sodium",null,null,null,"Tungsten halogen (ELV)-Electronic",1.08,0,null,null,null,null,null,null,null,"EEI A1",null,null,null,null,"Switched Maintained Emergency Luminaire with a Control System listed Table A10.4 or Table A10.4A",8500]
["AEMO-Active Reactor High Pressure Sodium",null,null,null,"CFLi-None",1,0,null,null,null,null,null,null,null,null,null,null,null,null,"Stairways, including fire-isolated stairways"]
["AEMO-Low Pressure Sodium",null,null,null,"Tungsten halogen (240V)-None",1,0,null,null,null,null,null,null,null,"Metal halide",null,null,null,null,"Lift cars"]
["AEMO-Metal Halide (Reactor control gear)",null,null,null,"LED Lamp only - ELV-Magnetic",1.25,0,"NLP",null,null,null,null,null,null,"Magnetic(reactor)",null,null,null,null,"Other spaces not defined above"]
["AEMO-Active Reactor Metal Halide",null,null,null,"LED Lamp only - ELV-Electronic",1.08,0,"NLP",null,null,null,null,null,null,"Magnetic(constant wattage)",null,null,null,null,"BCA Building Classification (A10.3)"]
["AEMO-Fluorescent",null,null,null,"LED Lamp only - 240V Self Ballasted-None",1,0,"LCP",null,null,null,null,null,null,"Electronic(non-integrated)",null,null,null,null,"Class 2 (Common Area)",7000,"A (Others)"]
["AEMO-Compact Fluorescent",null,null,null,"LED Lamp and Driver-Built In",1,0,"LCP",null,null,null,null,null,null,"Built In",null,null,null,null,"Class 3 (Common Area)",7000,"A (Others)"]
["AEMO-Incandescent",null,null,null,"LED Lamp and Driver-Independent",1,0,"LCP",null,null,null,null,null,null,"Mercury Vapour",null,null,null,null,"Class 3 (Other than Common Areas)",3000,"A (Others)"]
["Lighting for Roads and Public Spaces or Traffic Signals (other than LED lighting)",null,null,null,"LED Luminaire (Fixed Type)-Built In",1,0,"LCP",null,null,null,null,null,null,"Magnetic (non-integrated)",null,null,null,null,"Class 5",3000,"B (Office)"]
[null,null,null,null,"LED Luminaire (Fixed Type)-Independent",1,0,"LCP",null,null,null,null,null,null,"Built In",null,null,null,null,"Class 6",5000,"D (Retail)"]
[null,null,null,null,"LED Luminaire (Floodlight)-Built In",1,0,"LCP",null,null,null,null,null,null,"High pressure sodium",null,null,null,null,"Class 7b",5000,"C (Industrial)"]
[null,null,null,null,"LED Luminaire (Floodlight)-Independent",1,0,"LCP",null,null,null,null,null,null,"Magnetic",null,null,null,null,"Class 7a (open air car parks)",4500,"C (Industrial)"]
[null,null,null,null,"LED Luminaire (Recessed)-Built In",1,0,"LCP",null,null,null,null,null,null,null,null,null,null,null,"Class 7a (undercover car parks)",7000,"C (Industrial)"]
[null,null,null,null,"LED Luminaire (Recessed)-Independent",1,0,"LCP",null,null,null,null,null,null,"Tungsten halogen-240V",null,null,null,null,"Class 8 (Other than ANZIC Code C, Manufacturing)",3000,"A (Others)"]
[null,null,null,null,"LED Luminaire (High/Low Bay)-Built In",1,0,"LCP",null,null,null,null,null,null,"None",null,null,null,null,"Class 8 (ANZIC Code C, Manufacturing)",5000,"C (Industrial)"]
[null,null,null,null,"LED Luminaire (High/Low Bay)-Independent",1,0,"LCP",null,null,null,null,null,null,null,null,null,null,null,"Class 9a or Class 9c",6000,"A (Others)"]
[null,null,null,null,"LED Luminaire (Streetlight)-Built In",1,0,"LCP (as Published by AEMO)",null,null,null,null,null,null,"CFLi",null,null,null,null,"Class 9b",2000,"A (Others)"]
[null,null,null,null,"LED Luminaire (Streetlight)-Independent",1,0,"LCP (as Published by AEMO)",null,null,null,null,null,null,"None",null,null,null,null,"Class 10a",1000,"A (Others)"]
[null,null,null,null,"LED Luminaire (Emergency Lighting)-Built In",1,0,"LCP",null,null,null,null,null,null,null,null,null,null,null,"Class 10b",1000,"A (Others)"]
[null,null,null,null,"LED Luminaire (Emergency Lighting)-Independent",1,0,"LCP",null,null,null,null,null,null,"Tungsten halogen-ELV",null,null,null,null,"Lighting for Roads and Public Spaces",4500,"E (Public)"]
[null,null,null,null,"LED Luminaire (Hospital Use)-Built In",1,0,"LCP",null,null,null,null,null,null,"Magnetic",null,null,null,null,"AS 1158 Classifications"]
[null,null,null,null,"LED Luminaire (Hospital Use)-Independent",1,0,"LCP",null,null,null,null,null,null,"Electronic",null,null,null,null,"Pedestrian P1",4500,"E (Public)"]
[null,null,null,null,"Induction Luminaire-Built In",1,0,"LCP",null,null,null,null,null,null,null,null,null,null,null,"Pedestrian P2",4500,"E (Public)"]
[null,null,null,null,"Existing ELT-Not Applicable",1,0,"LCP",null,null,null,null,null,null,"Emerging Technology",null,null,null,null,"Pedestrian P3",4500,"E (Public)"]
[null,null,null,null,"None-Not Applicable",0,0,"LCP",null,null,null,null,null,null,"Integrated",null,null,null,null,"Pedestrian P4",4500,"E (Public)"]
[null,null,null,null,"Specific LCP request-Independent-Please Specify Model",1,0,"LCP",null,null,null,null,null,null,"Electronic ",null,null,null,null,"Pedestrian P5",4500,"E (Public)"]
[null,null,null,null,"Specific LCP request-Built In",1,0,"LCP",null,null,null,null,null,null,"Magnetic",null,null,null,null,"Pedestrian P6",4500,"E (Public)"]
[null,null,null,null,"Specific LCP request-Electronic-Lamp only",1.08,0,"NLP",null,null,null,null,null,null,"None",null,null,null,null,"Pedestrian P7",4500,"E (Public)"]
[null,null,null,null,"Specific LCP request-Magnetic-Lamp only",1.25,0,"NLP",null,null,null,null,null,null,null,null,null,null,null,"Pedestrian P8",4500,"E (Public)"]
[null,null,null,null,"Infra Red Coated halogen (ELV)-Magnetic",1.25,0,"NLP",null,null,null,null,null,null,null,null,null,null,null,"Pedestrian P9",4500,"E (Public)"]
[null,null,null,null,"Infra Red Coated halogen (ELV)-Electronic",1.08,0,"NLP",null,null,null,null,null,null,"LED lamp only",null,null,null,null,"Pedestrian P10",4500,"E (Public)"]
[null,null,null,null,"Modified Luminaire (LED Linear Lamp)-Built In",1,0,"LCP",null,null,null,null,null,null,"Magnetic",null,null,null,null,"Pedestrian P11a",4500,"E (Public)"]
[null,null,null,null,"Modified Luminaire (LED Linear Lamp)-Independent",1,0,"LCP",null,null,null,null,null,null,"Electronic",null,null,null,null,"Pedestrian P11b",4500,"E (Public)"]
[null,null,null,null,"LED Luminaire (Linear Lamp)-Built In",1,0,"LCP",null,null,null,null,null,null,"None",null,null,null,null,"Pedestrian P11c",4500,"E (Public)"]
[null,null,null,null,"LED Luminaire (Linear Lamp)-Independent",1,0,"LCP",null,null,null,null,null,null,"LED lamp and driver",null,null,null,null,"Pedestrian P12",4500,"E (Public)"]
[null,null,null,null,"Other Emerging Lighting Technology-Built In",1,0,"LCP",null,null,null,null,null,null,"Built In",null,null,null,null,"Vehicular V1",4500,"E (Public)"]
[null,null,null,null,"Other Emerging Lighting Technology-Independent",1,0,"LCP",null,null,null,null,null,null,"Independent",null,null,null,null,"Vehicular V2",4500,"E (Public)"]
[null,null,null,null,"Roads and Public Spaces",null,null,null,null,null,null,null,null,null,null,null,null,null,null,"Vehicular V3",4500,"E (Public)"]
[null,null,null,null,"AEMO-High Pressure Sodium-Built In",1,0,"LCP (as Published by AEMO)",null,null,null,null,null,null,"LED integrated ballast",null,null,null,null,"Vehicular V4",4500,"E (Public)"]
[null,null,null,null,"AEMO-Active Reactor High Pressure Sodium-Built In",1,0,"LCP (as Published by AEMO)",null,null,null,null,null,null,"Integrated",null,null,null,null,"Vehicular V5",4500,"E (Public)"]
[null,null,null,null,"AEMO-Metal Halide (Reactor control gear)-Built In",1,0,"LCP (as Published by AEMO)",null,null,null,null,null,null,null,null,null,null,null,"Pedestrian Crossing PX1",4500,"E (Public)"]
[null,null,null,null,"AEMO-Active Reactor Metal Halide-Built In",1,0,"LCP (as Published by AEMO)",null,null,null,null,null,null,"Induction luminaire",null,null,null,null,"Pedestrian Crossing PX2",4500,"E (Public)"]
[null,null,null,null,"AEMO-Low Pressure Sodium-Built In",1,0,"LCP (as Published by AEMO)",null,null,null,null,null,null,"Built In",null,null,null,null,"Pedestrian Crossing PX3",4500,"E (Public)"]
[null,null,null,null,"AEMO-Fluorescent-Built In",1,0,"LCP (as Published by AEMO)"]
[null,null,null,null,"AEMO-Compact Fluorescent-Built In",1,0,"LCP (as Published by AEMO)",null,null,null,null,null,null,"T5 adaptor kit"]
[null,null,null,null,"AEMO-Incandescent-Built In",1,0,"LCP (as Published by AEMO)",null,null,null,null,null,null,"Integrated"]
[null,null,null,null,"AEMO-High Pressure Sodium-Independent",1,0,"LCP (as Published by AEMO)"]
[null,null,null,null,"AEMO-Active Reactor High Pressure Sodium-Independent",1,0,"LCP (as Published by AEMO)",null,null,null,null,null,null,"LED TUBE"]
[null,null,null,null,"AEMO-Metal Halide (Reactor control gear)-Independent",1,0,"LCP (as Published by AEMO)",null,null,null,null,null,null,"Integrated"]
[null,null,null,null,"AEMO-Active Reactor Metal Halide-Independent",1,0,"LCP (as Published by AEMO)"]
[null,null,null,null,"AEMO-Low Pressure Sodium-Independent",1,0,"LCP (as Published by AEMO)",null,null,null,null,null,null,"Other emerging lighting technology"]
[null,null,null,null,"AEMO-Fluorescent-Independent",1,0,"LCP (as Published by AEMO)",null,null,null,null,null,null,"Integrated"]
[null,null,null,null,"AEMO-Compact Fluorescent-Independent",1,0,"LCP (as Published by AEMO)"]
[null,null,null,null,"AEMO-Incandescent-Independent",1,0,"LCP (as Published by AEMO)",null,null,null,null,null,null,"Specific LCP request "]
[null,null,null,null,"AEMO-Mercury Vapour-Independent",1,0,"LCP (as Published by AEMO)",null,null,null,null,null,null,"Independent-Please Specify Model"]
[null,null,null,null,"AEMO-Mercury Vapour-Built In",1,0,"LCP (as Published by AEMO)",null,null,null,null,null,null,"Built In"]
[null,null,null,null,"Lighting for Roads and Public Spaces or Traffic Signals (other than LED lighting)-Independent",1,0,"LCP (as Published by AEMO)",null,null,null,null,null,null,"Electronic-Lamp only"]
[null,null,null,null,"Lighting for Roads and Public Spaces or Traffic Signals (other than LED lighting)-Built In",1,0,"LCP (as Published by AEMO)",null,null,null,null,null,null,"Magnetic-Lamp only"]
[null,null,null,null,"Unknown EEI"]
[null,null,null,null,"T8 or T12 Linear-EEI Unknown (Magnetic)",1,10,"NLP",null,null,null,null,null,null,"Existing ELT"]
[null,null,null,null,"T8 or T12 Linear-EEI Unknown (Electronic)",1,2,"NLP",null,null,null,null,null,null,"Not Applicable"]
[null,null,null,null,"T5 Linear or T5 Circular-EEI Unknown (Electronic)",1.1299999999999999,2.5,"NLP"]
[null,null,null,null,"T9 or T12 Circular fluorescent-EEI Unknown (Magnetic)",1,10,"NLP",null,null,null,null,null,null,"None"]
[null,null,null,null,"T9 or T12 Circular fluorescent-EEI Unknown (Electronic)",1,2,"NLP",null,null,null,null,null,null,"Not Applicable"]
[null,null,null,null,"CFLn-EEI Unknown (Electronic)",1,3,"NLP"]
[null,null,null,null,"CFLn-EEI Unknown (Magnetic)",1,9,"NLP",null,null,null,null,null,null,"LED LUMINAIRE"]
[null,null,null,null,null,null,null,null,null,null,null,null,null,null,"Built In"]
[null,null,null,null,"New Ballast options 31 July 2018",null,null,null,null,null,null,null,null,null,"Independent"]
[null,null,null,null,"Metal halide-Built In",1,0,"NLP"]
[null,null,null,null,"Mercury Vapour-Built In",1,0,"NLP",null,null,null,null,null,null,"Lighting for Roads and Public Spaces"]
[null,null,null,null,null,null,null,null,null,null,null,null,null,null,"Built In"]
[null,null,null,null,null,null,null,null,null,null,null,null,null,null,"Independent"]
[]
[]
[]
[]
[null,null,null,null,null,null,null,null,null,null,null,null,null,null,"Unknown EEI"]
[null,null,null,null,null,null,null,null,null,null,null,null,null,null,"EEI Unknown (Magnetic)"]
[null,null,null,null,null,null,null,null,null,null,null,null,null,null,"EEI Unknown (Electronic)"]

{"sheet":"Summary","index":4,"n_rows":106,"n_cols":7,"rows_kept":106,"cut":false,"hidden":false,"merged":[]}
[]
[]
[]
[]
[1,2,9,11,12,13,17]
["Number","Space","Implementation Date","Baseline Consumption (MWh)","Upgrade Consumption (MWh)","Savings (MWh)","ESCs Generated"]
[1,{"$f":"IF( Input!B7=\"\",\"\",Input!B7)","v":""},{"$f":"IF(Input!T7=\"\",\"\",Input!T7)","v":""},{"$f":"IF(Input!AI7=\"\",\"\",Input!AI7)","v":""},{"$f":"IF(Input!AV7=\"\",\"\",Input!AV7)","v":""},{"$f":"IF(Input!U7=\"\",\"\",Input!U7)","v":""},{"$f":"IF(Input!V7=\"\",\"\",Input!V7)","v":""}]
[2,{"$f":"IF( Input!B8=\"\",\"\",Input!B8)","v":""},{"$f":"IF(Input!T8=\"\",\"\",Input!T8)","v":""},{"$f":"IF(Input!AI8=\"\",\"\",Input!AI8)","v":""},{"$f":"IF(Input!AV8=\"\",\"\",Input!AV8)","v":""},{"$f":"IF(Input!U8=\"\",\"\",Input!U8)","v":""},{"$f":"IF(Input!V8=\"\",\"\",Input!V8)","v":""}]
[3,{"$f":"IF( Input!B9=\"\",\"\",Input!B9)","v":""},{"$f":"IF(Input!T9=\"\",\"\",Input!T9)","v":""},{"$f":"IF(Input!AI9=\"\",\"\",Input!AI9)","v":""},{"$f":"IF(Input!AV9=\"\",\"\",Input!AV9)","v":""},{"$f":"IF(Input!U9=\"\",\"\",Input!U9)","v":""},{"$f":"IF(Input!V9=\"\",\"\",Input!V9)","v":""}]
[4,{"$f":"IF( Input!B10=\"\",\"\",Input!B10)","v":""},{"$f":"IF(Input!T10=\"\",\"\",Input!T10)","v":""},{"$f":"IF(Input!AI10=\"\",\"\",Input!AI10)","v":""},{"$f":"IF(Input!AV10=\"\",\"\",Input!AV10)","v":""},{"$f":"IF(Input!U10=\"\",\"\",Input!U10)","v":""},{"$f":"IF(Input!V10=\"\",\"\",Input!V10)","v":""}]
[5,{"$f":"IF( Input!B11=\"\",\"\",Input!B11)","v":""},{"$f":"IF(Input!T11=\"\",\"\",Input!T11)","v":""},{"$f":"IF(Input!AI11=\"\",\"\",Input!AI11)","v":""},{"$f":"IF(Input!AV11=\"\",\"\",Input!AV11)","v":""},{"$f":"IF(Input!U11=\"\",\"\",Input!U11)","v":""},{"$f":"IF(Input!V11=\"\",\"\",Input!V11)","v":""}]
[6,{"$f":"IF( Input!B12=\"\",\"\",Input!B12)","v":""},{"$f":"IF(Input!T12=\"\",\"\",Input!T12)","v":""},{"$f":"IF(Input!AI12=\"\",\"\",Input!AI12)","v":""},{"$f":"IF(Input!AV12=\"\",\"\",Input!AV12)","v":""},{"$f":"IF(Input!U12=\"\",\"\",Input!U12)","v":""},{"$f":"IF(Input!V12=\"\",\"\",Input!V12)","v":""}]
[7,{"$f":"IF( Input!B13=\"\",\"\",Input!B13)","v":""},{"$f":"IF(Input!T13=\"\",\"\",Input!T13)","v":""},{"$f":"IF(Input!AI13=\"\",\"\",Input!AI13)","v":""},{"$f":"IF(Input!AV13=\"\",\"\",Input!AV13)","v":""},{"$f":"IF(Input!U13=\"\",\"\",Input!U13)","v":""},{"$f":"IF(Input!V13=\"\",\"\",Input!V13)","v":""}]
[8,{"$f":"IF( Input!B14=\"\",\"\",Input!B14)","v":""},{"$f":"IF(Input!T14=\"\",\"\",Input!T14)","v":""},{"$f":"IF(Input!AI14=\"\",\"\",Input!AI14)","v":""},{"$f":"IF(Input!AV14=\"\",\"\",Input!AV14)","v":""},{"$f":"IF(Input!U14=\"\",\"\",Input!U14)","v":""},{"$f":"IF(Input!V14=\"\",\"\",Input!V14)","v":""}]
[9,{"$f":"IF( Input!B15=\"\",\"\",Input!B15)","v":""},{"$f":"IF(Input!T15=\"\",\"\",Input!T15)","v":""},{"$f":"IF(Input!AI15=\"\",\"\",Input!AI15)","v":""},{"$f":"IF(Input!AV15=\"\",\"\",Input!AV15)","v":""},{"$f":"IF(Input!U15=\"\",\"\",Input!U15)","v":""},{"$f":"IF(Input!V15=\"\",\"\",Input!V15)","v":""}]
[10,{"$f":"IF( Input!B16=\"\",\"\",Input!B16)","v":""},{"$f":"IF(Input!T16=\"\",\"\",Input!T16)","v":""},{"$f":"IF(Input!AI16=\"\",\"\",Input!AI16)","v":""},{"$f":"IF(Input!AV16=\"\",\"\",Input!AV16)","v":""},{"$f":"IF(Input!U16=\"\",\"\",Input!U16)","v":""},{"$f":"IF(Input!V16=\"\",\"\",Input!V16)","v":""}]
[11,{"$f":"IF( Input!B17=\"\",\"\",Input!B17)","v":""},{"$f":"IF(Input!T17=\"\",\"\",Input!T17)","v":""},{"$f":"IF(Input!AI17=\"\",\"\",Input!AI17)","v":""},{"$f":"IF(Input!AV17=\"\",\"\",Input!AV17)","v":""},{"$f":"IF(Input!U17=\"\",\"\",Input!U17)","v":""},{"$f":"IF(Input!V17=\"\",\"\",Input!V17)","v":""}]
[12,{"$f":"IF( Input!B18=\"\",\"\",Input!B18)","v":""},{"$f":"IF(Input!T18=\"\",\"\",Input!T18)","v":""},{"$f":"IF(Input!AI18=\"\",\"\",Input!AI18)","v":""},{"$f":"IF(Input!AV18=\"\",\"\",Input!AV18)","v":""},{"$f":"IF(Input!U18=\"\",\"\",Input!U18)","v":""},{"$f":"IF(Input!V18=\"\",\"\",Input!V18)","v":""}]
[13,{"$f":"IF( Input!B19=\"\",\"\",Input!B19)","v":""},{"$f":"IF(Input!T19=\"\",\"\",Input!T19)","v":""},{"$f":"IF(Input!AI19=\"\",\"\",Input!AI19)","v":""},{"$f":"IF(Input!AV19=\"\",\"\",Input!AV19)","v":""},{"$f":"IF(Input!U19=\"\",\"\",Input!U19)","v":""},{"$f":"IF(Input!V19=\"\",\"\",Input!V19)","v":""}]
[14,{"$f":"IF( Input!B20=\"\",\"\",Input!B20)","v":""},{"$f":"IF(Input!T20=\"\",\"\",Input!T20)","v":""},{"$f":"IF(Input!AI20=\"\",\"\",Input!AI20)","v":""},{"$f":"IF(Input!AV20=\"\",\"\",Input!AV20)","v":""},{"$f":"IF(Input!U20=\"\",\"\",Input!U20)","v":""},{"$f":"IF(Input!V20=\"\",\"\",Input!V20)","v":""}]
[15,{"$f":"IF( Input!B21=\"\",\"\",Input!B21)","v":""},{"$f":"IF(Input!T21=\"\",\"\",Input!T21)","v":""},{"$f":"IF(Input!AI21=\"\",\"\",Input!AI21)","v":""},{"$f":"IF(Input!AV21=\"\",\"\",Input!AV21)","v":""},{"$f":"IF(Input!U21=\"\",\"\",Input!U21)","v":""},{"$f":"IF(Input!V21=\"\",\"\",Input!V21)","v":""}]
[16,{"$f":"IF( Input!B22=\"\",\"\",Input!B22)","v":""},{"$f":"IF(Input!T22=\"\",\"\",Input!T22)","v":""},{"$f":"IF(Input!AI22=\"\",\"\",Input!AI22)","v":""},{"$f":"IF(Input!AV22=\"\",\"\",Input!AV22)","v":""},{"$f":"IF(Input!U22=\"\",\"\",Input!U22)","v":""},{"$f":"IF(Input!V22=\"\",\"\",Input!V22)","v":""}]
[17,{"$f":"IF( Input!B23=\"\",\"\",Input!B23)","v":""},{"$f":"IF(Input!T23=\"\",\"\",Input!T23)","v":""},{"$f":"IF(Input!AI23=\"\",\"\",Input!AI23)","v":""},{"$f":"IF(Input!AV23=\"\",\"\",Input!AV23)","v":""},{"$f":"IF(Input!U23=\"\",\"\",Input!U23)","v":""},{"$f":"IF(Input!V23=\"\",\"\",Input!V23)","v":""}]
[18,{"$f":"IF( Input!B24=\"\",\"\",Input!B24)","v":""},{"$f":"IF(Input!T24=\"\",\"\",Input!T24)","v":""},{"$f":"IF(Input!AI24=\"\",\"\",Input!AI24)","v":""},{"$f":"IF(Input!AV24=\"\",\"\",Input!AV24)","v":""},{"$f":"IF(Input!U24=\"\",\"\",Input!U24)","v":""},{"$f":"IF(Input!V24=\"\",\"\",Input!V24)","v":""}]
[19,{"$f":"IF( Input!B25=\"\",\"\",Input!B25)","v":""},{"$f":"IF(Input!T25=\"\",\"\",Input!T25)","v":""},{"$f":"IF(Input!AI25=\"\",\"\",Input!AI25)","v":""},{"$f":"IF(Input!AV25=\"\",\"\",Input!AV25)","v":""},{"$f":"IF(Input!U25=\"\",\"\",Input!U25)","v":""},{"$f":"IF(Input!V25=\"\",\"\",Input!V25)","v":""}]
[20,{"$f":"IF( Input!B26=\"\",\"\",Input!B26)","v":""},{"$f":"IF(Input!T26=\"\",\"\",Input!T26)","v":""},{"$f":"IF(Input!AI26=\"\",\"\",Input!AI26)","v":""},{"$f":"IF(Input!AV26=\"\",\"\",Input!AV26)","v":""},{"$f":"IF(Input!U26=\"\",\"\",Input!U26)","v":""},{"$f":"IF(Input!V26=\"\",\"\",Input!V26)","v":""}]
[21,{"$f":"IF( Input!B27=\"\",\"\",Input!B27)","v":""},{"$f":"IF(Input!T27=\"\",\"\",Input!T27)","v":""},{"$f":"IF(Input!AI27=\"\",\"\",Input!AI27)","v":""},{"$f":"IF(Input!AV27=\"\",\"\",Input!AV27)","v":""},{"$f":"IF(Input!U27=\"\",\"\",Input!U27)","v":""},{"$f":"IF(Input!V27=\"\",\"\",Input!V27)","v":""}]
[22,{"$f":"IF( Input!B28=\"\",\"\",Input!B28)","v":""},{"$f":"IF(Input!T28=\"\",\"\",Input!T28)","v":""},{"$f":"IF(Input!AI28=\"\",\"\",Input!AI28)","v":""},{"$f":"IF(Input!AV28=\"\",\"\",Input!AV28)","v":""},{"$f":"IF(Input!U28=\"\",\"\",Input!U28)","v":""},{"$f":"IF(Input!V28=\"\",\"\",Input!V28)","v":""}]
[23,{"$f":"IF( Input!B29=\"\",\"\",Input!B29)","v":""},{"$f":"IF(Input!T29=\"\",\"\",Input!T29)","v":""},{"$f":"IF(Input!AI29=\"\",\"\",Input!AI29)","v":""},{"$f":"IF(Input!AV29=\"\",\"\",Input!AV29)","v":""},{"$f":"IF(Input!U29=\"\",\"\",Input!U29)","v":""},{"$f":"IF(Input!V29=\"\",\"\",Input!V29)","v":""}]
[24,{"$f":"IF( Input!B30=\"\",\"\",Input!B30)","v":""},{"$f":"IF(Input!T30=\"\",\"\",Input!T30)","v":""},{"$f":"IF(Input!AI30=\"\",\"\",Input!AI30)","v":""},{"$f":"IF(Input!AV30=\"\",\"\",Input!AV30)","v":""},{"$f":"IF(Input!U30=\"\",\"\",Input!U30)","v":""},{"$f":"IF(Input!V30=\"\",\"\",Input!V30)","v":""}]
[25,{"$f":"IF( Input!B31=\"\",\"\",Input!B31)","v":""},{"$f":"IF(Input!T31=\"\",\"\",Input!T31)","v":""},{"$f":"IF(Input!AI31=\"\",\"\",Input!AI31)","v":""},{"$f":"IF(Input!AV31=\"\",\"\",Input!AV31)","v":""},{"$f":"IF(Input!U31=\"\",\"\",Input!U31)","v":""},{"$f":"IF(Input!V31=\"\",\"\",Input!V31)","v":""}]
[26,{"$f":"IF( Input!B32=\"\",\"\",Input!B32)","v":""},{"$f":"IF(Input!T32=\"\",\"\",Input!T32)","v":""},{"$f":"IF(Input!AI32=\"\",\"\",Input!AI32)","v":""},{"$f":"IF(Input!AV32=\"\",\"\",Input!AV32)","v":""},{"$f":"IF(Input!U32=\"\",\"\",Input!U32)","v":""},{"$f":"IF(Input!V32=\"\",\"\",Input!V32)","v":""}]
[27,{"$f":"IF( Input!B33=\"\",\"\",Input!B33)","v":""},{"$f":"IF(Input!T33=\"\",\"\",Input!T33)","v":""},{"$f":"IF(Input!AI33=\"\",\"\",Input!AI33)","v":""},{"$f":"IF(Input!AV33=\"\",\"\",Input!AV33)","v":""},{"$f":"IF(Input!U33=\"\",\"\",Input!U33)","v":""},{"$f":"IF(Input!V33=\"\",\"\",Input!V33)","v":""}]
[28,{"$f":"IF( Input!B34=\"\",\"\",Input!B34)","v":""},{"$f":"IF(Input!T34=\"\",\"\",Input!T34)","v":""},{"$f":"IF(Input!AI34=\"\",\"\",Input!AI34)","v":""},{"$f":"IF(Input!AV34=\"\",\"\",Input!AV34)","v":""},{"$f":"IF(Input!U34=\"\",\"\",Input!U34)","v":""},{"$f":"IF(Input!V34=\"\",\"\",Input!V34)","v":""}]
[29,{"$f":"IF( Input!B35=\"\",\"\",Input!B35)","v":""},{"$f":"IF(Input!T35=\"\",\"\",Input!T35)","v":""},{"$f":"IF(Input!AI35=\"\",\"\",Input!AI35)","v":""},{"$f":"IF(Input!AV35=\"\",\"\",Input!AV35)","v":""},{"$f":"IF(Input!U35=\"\",\"\",Input!U35)","v":""},{"$f":"IF(Input!V35=\"\",\"\",Input!V35)","v":""}]
[30,{"$f":"IF( Input!B36=\"\",\"\",Input!B36)","v":""},{"$f":"IF(Input!T36=\"\",\"\",Input!T36)","v":""},{"$f":"IF(Input!AI36=\"\",\"\",Input!AI36)","v":""},{"$f":"IF(Input!AV36=\"\",\"\",Input!AV36)","v":""},{"$f":"IF(Input!U36=\"\",\"\",Input!U36)","v":""},{"$f":"IF(Input!V36=\"\",\"\",Input!V36)","v":""}]
[31,{"$f":"IF( Input!B37=\"\",\"\",Input!B37)","v":""},{"$f":"IF(Input!T37=\"\",\"\",Input!T37)","v":""},{"$f":"IF(Input!AI37=\"\",\"\",Input!AI37)","v":""},{"$f":"IF(Input!AV37=\"\",\"\",Input!AV37)","v":""},{"$f":"IF(Input!U37=\"\",\"\",Input!U37)","v":""},{"$f":"IF(Input!V37=\"\",\"\",Input!V37)","v":""}]
[32,{"$f":"IF( Input!B38=\"\",\"\",Input!B38)","v":""},{"$f":"IF(Input!T38=\"\",\"\",Input!T38)","v":""},{"$f":"IF(Input!AI38=\"\",\"\",Input!AI38)","v":""},{"$f":"IF(Input!AV38=\"\",\"\",Input!AV38)","v":""},{"$f":"IF(Input!U38=\"\",\"\",Input!U38)","v":""},{"$f":"IF(Input!V38=\"\",\"\",Input!V38)","v":""}]
[33,{"$f":"IF( Input!B39=\"\",\"\",Input!B39)","v":""},{"$f":"IF(Input!T39=\"\",\"\",Input!T39)","v":""},{"$f":"IF(Input!AI39=\"\",\"\",Input!AI39)","v":""},{"$f":"IF(Input!AV39=\"\",\"\",Input!AV39)","v":""},{"$f":"IF(Input!U39=\"\",\"\",Input!U39)","v":""},{"$f":"IF(Input!V39=\"\",\"\",Input!V39)","v":""}]
[34,{"$f":"IF( Input!B40=\"\",\"\",Input!B40)","v":""},{"$f":"IF(Input!T40=\"\",\"\",Input!T40)","v":""},{"$f":"IF(Input!AI40=\"\",\"\",Input!AI40)","v":""},{"$f":"IF(Input!AV40=\"\",\"\",Input!AV40)","v":""},{"$f":"IF(Input!U40=\"\",\"\",Input!U40)","v":""},{"$f":"IF(Input!V40=\"\",\"\",Input!V40)","v":""}]
[35,{"$f":"IF( Input!B41=\"\",\"\",Input!B41)","v":""},{"$f":"IF(Input!T41=\"\",\"\",Input!T41)","v":""},{"$f":"IF(Input!AI41=\"\",\"\",Input!AI41)","v":""},{"$f":"IF(Input!AV41=\"\",\"\",Input!AV41)","v":""},{"$f":"IF(Input!U41=\"\",\"\",Input!U41)","v":""},{"$f":"IF(Input!V41=\"\",\"\",Input!V41)","v":""}]
[36,{"$f":"IF( Input!B42=\"\",\"\",Input!B42)","v":""},{"$f":"IF(Input!T42=\"\",\"\",Input!T42)","v":""},{"$f":"IF(Input!AI42=\"\",\"\",Input!AI42)","v":""},{"$f":"IF(Input!AV42=\"\",\"\",Input!AV42)","v":""},{"$f":"IF(Input!U42=\"\",\"\",Input!U42)","v":""},{"$f":"IF(Input!V42=\"\",\"\",Input!V42)","v":""}]
[37,{"$f":"IF( Input!B43=\"\",\"\",Input!B43)","v":""},{"$f":"IF(Input!T43=\"\",\"\",Input!T43)","v":""},{"$f":"IF(Input!AI43=\"\",\"\",Input!AI43)","v":""},{"$f":"IF(Input!AV43=\"\",\"\",Input!AV43)","v":""},{"$f":"IF(Input!U43=\"\",\"\",Input!U43)","v":""},{"$f":"IF(Input!V43=\"\",\"\",Input!V43)","v":""}]
[38,{"$f":"IF( Input!B44=\"\",\"\",Input!B44)","v":""},{"$f":"IF(Input!T44=\"\",\"\",Input!T44)","v":""},{"$f":"IF(Input!AI44=\"\",\"\",Input!AI44)","v":""},{"$f":"IF(Input!AV44=\"\",\"\",Input!AV44)","v":""},{"$f":"IF(Input!U44=\"\",\"\",Input!U44)","v":""},{"$f":"IF(Input!V44=\"\",\"\",Input!V44)","v":""}]
[39,{"$f":"IF( Input!B45=\"\",\"\",Input!B45)","v":""},{"$f":"IF(Input!T45=\"\",\"\",Input!T45)","v":""},{"$f":"IF(Input!AI45=\"\",\"\",Input!AI45)","v":""},{"$f":"IF(Input!AV45=\"\",\"\",Input!AV45)","v":""},{"$f":"IF(Input!U45=\"\",\"\",Input!U45)","v":""},{"$f":"IF(Input!V45=\"\",\"\",Input!V45)","v":""}]
[40,{"$f":"IF( Input!B46=\"\",\"\",Input!B46)","v":""},{"$f":"IF(Input!T46=\"\",\"\",Input!T46)","v":""},{"$f":"IF(Input!AI46=\"\",\"\",Input!AI46)","v":""},{"$f":"IF(Input!AV46=\"\",\"\",Input!AV46)","v":""},{"$f":"IF(Input!U46=\"\",\"\",Input!U46)","v":""},{"$f":"IF(Input!V46=\"\",\"\",Input!V46)","v":""}]
[41,{"$f":"IF( Input!B47=\"\",\"\",Input!B47)","v":""},{"$f":"IF(Input!T47=\"\",\"\",Input!T47)","v":""},{"$f":"IF(Input!AI47=\"\",\"\",Input!AI47)","v":""},{"$f":"IF(Input!AV47=\"\",\"\",Input!AV47)","v":""},{"$f":"IF(Input!U47=\"\",\"\",Input!U47)","v":""},{"$f":"IF(Input!V47=\"\",\"\",Input!V47)","v":""}]
[42,{"$f":"IF( Input!B48=\"\",\"\",Input!B48)","v":""},{"$f":"IF(Input!T48=\"\",\"\",Input!T48)","v":""},{"$f":"IF(Input!AI48=\"\",\"\",Input!AI48)","v":""},{"$f":"IF(Input!AV48=\"\",\"\",Input!AV48)","v":""},{"$f":"IF(Input!U48=\"\",\"\",Input!U48)","v":""},{"$f":"IF(Input!V48=\"\",\"\",Input!V48)","v":""}]
[43,{"$f":"IF( Input!B49=\"\",\"\",Input!B49)","v":""},{"$f":"IF(Input!T49=\"\",\"\",Input!T49)","v":""},{"$f":"IF(Input!AI49=\"\",\"\",Input!AI49)","v":""},{"$f":"IF(Input!AV49=\"\",\"\",Input!AV49)","v":""},{"$f":"IF(Input!U49=\"\",\"\",Input!U49)","v":""},{"$f":"IF(Input!V49=\"\",\"\",Input!V49)","v":""}]
[44,{"$f":"IF( Input!B50=\"\",\"\",Input!B50)","v":""},{"$f":"IF(Input!T50=\"\",\"\",Input!T50)","v":""},{"$f":"IF(Input!AI50=\"\",\"\",Input!AI50)","v":""},{"$f":"IF(Input!AV50=\"\",\"\",Input!AV50)","v":""},{"$f":"IF(Input!U50=\"\",\"\",Input!U50)","v":""},{"$f":"IF(Input!V50=\"\",\"\",Input!V50)","v":""}]
[45,{"$f":"IF( Input!B51=\"\",\"\",Input!B51)","v":""},{"$f":"IF(Input!T51=\"\",\"\",Input!T51)","v":""},{"$f":"IF(Input!AI51=\"\",\"\",Input!AI51)","v":""},{"$f":"IF(Input!AV51=\"\",\"\",Input!AV51)","v":""},{"$f":"IF(Input!U51=\"\",\"\",Input!U51)","v":""},{"$f":"IF(Input!V51=\"\",\"\",Input!V51)","v":""}]
[46,{"$f":"IF( Input!B52=\"\",\"\",Input!B52)","v":""},{"$f":"IF(Input!T52=\"\",\"\",Input!T52)","v":""},{"$f":"IF(Input!AI52=\"\",\"\",Input!AI52)","v":""},{"$f":"IF(Input!AV52=\"\",\"\",Input!AV52)","v":""},{"$f":"IF(Input!U52=\"\",\"\",Input!U52)","v":""},{"$f":"IF(Input!V52=\"\",\"\",Input!V52)","v":""}]
[47,{"$f":"IF( Input!B53=\"\",\"\",Input!B53)","v":""},{"$f":"IF(Input!T53=\"\",\"\",Input!T53)","v":""},{"$f":"IF(Input!AI53=\"\",\"\",Input!AI53)","v":""},{"$f":"IF(Input!AV53=\"\",\"\",Input!AV53)","v":""},{"$f":"IF(Input!U53=\"\",\"\",Input!U53)","v":""},{"$f":"IF(Input!V53=\"\",\"\",Input!V53)","v":""}]
[48,{"$f":"IF( Input!B54=\"\",\"\",Input!B54)","v":""},{"$f":"IF(Input!T54=\"\",\"\",Input!T54)","v":""},{"$f":"IF(Input!AI54=\"\",\"\",Input!AI54)","v":""},{"$f":"IF(Input!AV54=\"\",\"\",Input!AV54)","v":""},{"$f":"IF(Input!U54=\"\",\"\",Input!U54)","v":""},{"$f":"IF(Input!V54=\"\",\"\",Input!V54)","v":""}]
[49,{"$f":"IF( Input!B55=\"\",\"\",Input!B55)","v":""},{"$f":"IF(Input!T55=\"\",\"\",Input!T55)","v":""},{"$f":"IF(Input!AI55=\"\",\"\",Input!AI55)","v":""},{"$f":"IF(Input!AV55=\"\",\"\",Input!AV55)","v":""},{"$f":"IF(Input!U55=\"\",\"\",Input!U55)","v":""},{"$f":"IF(Input!V55=\"\",\"\",Input!V55)","v":""}]
[50,{"$f":"IF( Input!B56=\"\",\"\",Input!B56)","v":""},{"$f":"IF(Input!T56=\"\",\"\",Input!T56)","v":""},{"$f":"IF(Input!AI56=\"\",\"\",Input!AI56)","v":""},{"$f":"IF(Input!AV56=\"\",\"\",Input!AV56)","v":""},{"$f":"IF(Input!U56=\"\",\"\",Input!U56)","v":""},{"$f":"IF(Input!V56=\"\",\"\",Input!V56)","v":""}]
[51,{"$f":"IF( Input!B57=\"\",\"\",Input!B57)","v":""},{"$f":"IF(Input!T57=\"\",\"\",Input!T57)","v":""},{"$f":"IF(Input!AI57=\"\",\"\",Input!AI57)","v":""},{"$f":"IF(Input!AV57=\"\",\"\",Input!AV57)","v":""},{"$f":"IF(Input!U57=\"\",\"\",Input!U57)","v":""},{"$f":"IF(Input!V57=\"\",\"\",Input!V57)","v":""}]
[52,{"$f":"IF( Input!B58=\"\",\"\",Input!B58)","v":""},{"$f":"IF(Input!T58=\"\",\"\",Input!T58)","v":""},{"$f":"IF(Input!AI58=\"\",\"\",Input!AI58)","v":""},{"$f":"IF(Input!AV58=\"\",\"\",Input!AV58)","v":""},{"$f":"IF(Input!U58=\"\",\"\",Input!U58)","v":""},{"$f":"IF(Input!V58=\"\",\"\",Input!V58)","v":""}]
[53,{"$f":"IF( Input!B59=\"\",\"\",Input!B59)","v":""},{"$f":"IF(Input!T59=\"\",\"\",Input!T59)","v":""},{"$f":"IF(Input!AI59=\"\",\"\",Input!AI59)","v":""},{"$f":"IF(Input!AV59=\"\",\"\",Input!AV59)","v":""},{"$f":"IF(Input!U59=\"\",\"\",Input!U59)","v":""},{"$f":"IF(Input!V59=\"\",\"\",Input!V59)","v":""}]
[54,{"$f":"IF( Input!B60=\"\",\"\",Input!B60)","v":""},{"$f":"IF(Input!T60=\"\",\"\",Input!T60)","v":""},{"$f":"IF(Input!AI60=\"\",\"\",Input!AI60)","v":""},{"$f":"IF(Input!AV60=\"\",\"\",Input!AV60)","v":""},{"$f":"IF(Input!U60=\"\",\"\",Input!U60)","v":""},{"$f":"IF(Input!V60=\"\",\"\",Input!V60)","v":""}]
[55,{"$f":"IF( Input!B61=\"\",\"\",Input!B61)","v":""},{"$f":"IF(Input!T61=\"\",\"\",Input!T61)","v":""},{"$f":"IF(Input!AI61=\"\",\"\",Input!AI61)","v":""},{"$f":"IF(Input!AV61=\"\",\"\",Input!AV61)","v":""},{"$f":"IF(Input!U61=\"\",\"\",Input!U61)","v":""},{"$f":"IF(Input!V61=\"\",\"\",Input!V61)","v":""}]
[56,{"$f":"IF( Input!B62=\"\",\"\",Input!B62)","v":""},{"$f":"IF(Input!T62=\"\",\"\",Input!T62)","v":""},{"$f":"IF(Input!AI62=\"\",\"\",Input!AI62)","v":""},{"$f":"IF(Input!AV62=\"\",\"\",Input!AV62)","v":""},{"$f":"IF(Input!U62=\"\",\"\",Input!U62)","v":""},{"$f":"IF(Input!V62=\"\",\"\",Input!V62)","v":""}]
[57,{"$f":"IF( Input!B63=\"\",\"\",Input!B63)","v":""},{"$f":"IF(Input!T63=\"\",\"\",Input!T63)","v":""},{"$f":"IF(Input!AI63=\"\",\"\",Input!AI63)","v":""},{"$f":"IF(Input!AV63=\"\",\"\",Input!AV63)","v":""},{"$f":"IF(Input!U63=\"\",\"\",Input!U63)","v":""},{"$f":"IF(Input!V63=\"\",\"\",Input!V63)","v":""}]
[58,{"$f":"IF( Input!B64=\"\",\"\",Input!B64)","v":""},{"$f":"IF(Input!T64=\"\",\"\",Input!T64)","v":""},{"$f":"IF(Input!AI64=\"\",\"\",Input!AI64)","v":""},{"$f":"IF(Input!AV64=\"\",\"\",Input!AV64)","v":""},{"$f":"IF(Input!U64=\"\",\"\",Input!U64)","v":""},{"$f":"IF(Input!V64=\"\",\"\",Input!V64)","v":""}]
[59,{"$f":"IF( Input!B65=\"\",\"\",Input!B65)","v":""},{"$f":"IF(Input!T65=\"\",\"\",Input!T65)","v":""},{"$f":"IF(Input!AI65=\"\",\"\",Input!AI65)","v":""},{"$f":"IF(Input!AV65=\"\",\"\",Input!AV65)","v":""},{"$f":"IF(Input!U65=\"\",\"\",Input!U65)","v":""},{"$f":"IF(Input!V65=\"\",\"\",Input!V65)","v":""}]
[60,{"$f":"IF( Input!B66=\"\",\"\",Input!B66)","v":""},{"$f":"IF(Input!T66=\"\",\"\",Input!T66)","v":""},{"$f":"IF(Input!AI66=\"\",\"\",Input!AI66)","v":""},{"$f":"IF(Input!AV66=\"\",\"\",Input!AV66)","v":""},{"$f":"IF(Input!U66=\"\",\"\",Input!U66)","v":""},{"$f":"IF(Input!V66=\"\",\"\",Input!V66)","v":""}]
[61,{"$f":"IF( Input!B67=\"\",\"\",Input!B67)","v":""},{"$f":"IF(Input!T67=\"\",\"\",Input!T67)","v":""},{"$f":"IF(Input!AI67=\"\",\"\",Input!AI67)","v":""},{"$f":"IF(Input!AV67=\"\",\"\",Input!AV67)","v":""},{"$f":"IF(Input!U67=\"\",\"\",Input!U67)","v":""},{"$f":"IF(Input!V67=\"\",\"\",Input!V67)","v":""}]
[62,{"$f":"IF( Input!B68=\"\",\"\",Input!B68)","v":""},{"$f":"IF(Input!T68=\"\",\"\",Input!T68)","v":""},{"$f":"IF(Input!AI68=\"\",\"\",Input!AI68)","v":""},{"$f":"IF(Input!AV68=\"\",\"\",Input!AV68)","v":""},{"$f":"IF(Input!U68=\"\",\"\",Input!U68)","v":""},{"$f":"IF(Input!V68=\"\",\"\",Input!V68)","v":""}]
[63,{"$f":"IF( Input!B69=\"\",\"\",Input!B69)","v":""},{"$f":"IF(Input!T69=\"\",\"\",Input!T69)","v":""},{"$f":"IF(Input!AI69=\"\",\"\",Input!AI69)","v":""},{"$f":"IF(Input!AV69=\"\",\"\",Input!AV69)","v":""},{"$f":"IF(Input!U69=\"\",\"\",Input!U69)","v":""},{"$f":"IF(Input!V69=\"\",\"\",Input!V69)","v":""}]
[64,{"$f":"IF( Input!B70=\"\",\"\",Input!B70)","v":""},{"$f":"IF(Input!T70=\"\",\"\",Input!T70)","v":""},{"$f":"IF(Input!AI70=\"\",\"\",Input!AI70)","v":""},{"$f":"IF(Input!AV70=\"\",\"\",Input!AV70)","v":""},{"$f":"IF(Input!U70=\"\",\"\",Input!U70)","v":""},{"$f":"IF(Input!V70=\"\",\"\",Input!V70)","v":""}]
[65,{"$f":"IF( Input!B71=\"\",\"\",Input!B71)","v":""},{"$f":"IF(Input!T71=\"\",\"\",Input!T71)","v":""},{"$f":"IF(Input!AI71=\"\",\"\",Input!AI71)","v":""},{"$f":"IF(Input!AV71=\"\",\"\",Input!AV71)","v":""},{"$f":"IF(Input!U71=\"\",\"\",Input!U71)","v":""},{"$f":"IF(Input!V71=\"\",\"\",Input!V71)","v":""}]
[66,{"$f":"IF( Input!B72=\"\",\"\",Input!B72)","v":""},{"$f":"IF(Input!T72=\"\",\"\",Input!T72)","v":""},{"$f":"IF(Input!AI72=\"\",\"\",Input!AI72)","v":""},{"$f":"IF(Input!AV72=\"\",\"\",Input!AV72)","v":""},{"$f":"IF(Input!U72=\"\",\"\",Input!U72)","v":""},{"$f":"IF(Input!V72=\"\",\"\",Input!V72)","v":""}]
[67,{"$f":"IF( Input!B73=\"\",\"\",Input!B73)","v":""},{"$f":"IF(Input!T73=\"\",\"\",Input!T73)","v":""},{"$f":"IF(Input!AI73=\"\",\"\",Input!AI73)","v":""},{"$f":"IF(Input!AV73=\"\",\"\",Input!AV73)","v":""},{"$f":"IF(Input!U73=\"\",\"\",Input!U73)","v":""},{"$f":"IF(Input!V73=\"\",\"\",Input!V73)","v":""}]
[68,{"$f":"IF( Input!B74=\"\",\"\",Input!B74)","v":""},{"$f":"IF(Input!T74=\"\",\"\",Input!T74)","v":""},{"$f":"IF(Input!AI74=\"\",\"\",Input!AI74)","v":""},{"$f":"IF(Input!AV74=\"\",\"\",Input!AV74)","v":""},{"$f":"IF(Input!U74=\"\",\"\",Input!U74)","v":""},{"$f":"IF(Input!V74=\"\",\"\",Input!V74)","v":""}]
[69,{"$f":"IF( Input!B75=\"\",\"\",Input!B75)","v":""},{"$f":"IF(Input!T75=\"\",\"\",Input!T75)","v":""},{"$f":"IF(Input!AI75=\"\",\"\",Input!AI75)","v":""},{"$f":"IF(Input!AV75=\"\",\"\",Input!AV75)","v":""},{"$f":"IF(Input!U75=\"\",\"\",Input!U75)","v":""},{"$f":"IF(Input!V75=\"\",\"\",Input!V75)","v":""}]
[70,{"$f":"IF( Input!B76=\"\",\"\",Input!B76)","v":""},{"$f":"IF(Input!T76=\"\",\"\",Input!T76)","v":""},{"$f":"IF(Input!AI76=\"\",\"\",Input!AI76)","v":""},{"$f":"IF(Input!AV76=\"\",\"\",Input!AV76)","v":""},{"$f":"IF(Input!U76=\"\",\"\",Input!U76)","v":""},{"$f":"IF(Input!V76=\"\",\"\",Input!V76)","v":""}]
[71,{"$f":"IF( Input!B77=\"\",\"\",Input!B77)","v":""},{"$f":"IF(Input!T77=\"\",\"\",Input!T77)","v":""},{"$f":"IF(Input!AI77=\"\",\"\",Input!AI77)","v":""},{"$f":"IF(Input!AV77=\"\",\"\",Input!AV77)","v":""},{"$f":"IF(Input!U77=\"\",\"\",Input!U77)","v":""},{"$f":"IF(Input!V77=\"\",\"\",Input!V77)","v":""}]
[72,{"$f":"IF( Input!B78=\"\",\"\",Input!B78)","v":""},{"$f":"IF(Input!T78=\"\",\"\",Input!T78)","v":""},{"$f":"IF(Input!AI78=\"\",\"\",Input!AI78)","v":""},{"$f":"IF(Input!AV78=\"\",\"\",Input!AV78)","v":""},{"$f":"IF(Input!U78=\"\",\"\",Input!U78)","v":""},{"$f":"IF(Input!V78=\"\",\"\",Input!V78)","v":""}]
[73,{"$f":"IF( Input!B79=\"\",\"\",Input!B79)","v":""},{"$f":"IF(Input!T79=\"\",\"\",Input!T79)","v":""},{"$f":"IF(Input!AI79=\"\",\"\",Input!AI79)","v":""},{"$f":"IF(Input!AV79=\"\",\"\",Input!AV79)","v":""},{"$f":"IF(Input!U79=\"\",\"\",Input!U79)","v":""},{"$f":"IF(Input!V79=\"\",\"\",Input!V79)","v":""}]
[74,{"$f":"IF( Input!B80=\"\",\"\",Input!B80)","v":""},{"$f":"IF(Input!T80=\"\",\"\",Input!T80)","v":""},{"$f":"IF(Input!AI80=\"\",\"\",Input!AI80)","v":""},{"$f":"IF(Input!AV80=\"\",\"\",Input!AV80)","v":""},{"$f":"IF(Input!U80=\"\",\"\",Input!U80)","v":""},{"$f":"IF(Input!V80=\"\",\"\",Input!V80)","v":""}]
[75,{"$f":"IF( Input!B81=\"\",\"\",Input!B81)","v":""},{"$f":"IF(Input!T81=\"\",\"\",Input!T81)","v":""},{"$f":"IF(Input!AI81=\"\",\"\",Input!AI81)","v":""},{"$f":"IF(Input!AV81=\"\",\"\",Input!AV81)","v":""},{"$f":"IF(Input!U81=\"\",\"\",Input!U81)","v":""},{"$f":"IF(Input!V81=\"\",\"\",Input!V81)","v":""}]
[76,{"$f":"IF( Input!B82=\"\",\"\",Input!B82)","v":""},{"$f":"IF(Input!T82=\"\",\"\",Input!T82)","v":""},{"$f":"IF(Input!AI82=\"\",\"\",Input!AI82)","v":""},{"$f":"IF(Input!AV82=\"\",\"\",Input!AV82)","v":""},{"$f":"IF(Input!U82=\"\",\"\",Input!U82)","v":""},{"$f":"IF(Input!V82=\"\",\"\",Input!V82)","v":""}]
[77,{"$f":"IF( Input!B83=\"\",\"\",Input!B83)","v":""},{"$f":"IF(Input!T83=\"\",\"\",Input!T83)","v":""},{"$f":"IF(Input!AI83=\"\",\"\",Input!AI83)","v":""},{"$f":"IF(Input!AV83=\"\",\"\",Input!AV83)","v":""},{"$f":"IF(Input!U83=\"\",\"\",Input!U83)","v":""},{"$f":"IF(Input!V83=\"\",\"\",Input!V83)","v":""}]
[78,{"$f":"IF( Input!B84=\"\",\"\",Input!B84)","v":""},{"$f":"IF(Input!T84=\"\",\"\",Input!T84)","v":""},{"$f":"IF(Input!AI84=\"\",\"\",Input!AI84)","v":""},{"$f":"IF(Input!AV84=\"\",\"\",Input!AV84)","v":""},{"$f":"IF(Input!U84=\"\",\"\",Input!U84)","v":""},{"$f":"IF(Input!V84=\"\",\"\",Input!V84)","v":""}]
[79,{"$f":"IF( Input!B85=\"\",\"\",Input!B85)","v":""},{"$f":"IF(Input!T85=\"\",\"\",Input!T85)","v":""},{"$f":"IF(Input!AI85=\"\",\"\",Input!AI85)","v":""},{"$f":"IF(Input!AV85=\"\",\"\",Input!AV85)","v":""},{"$f":"IF(Input!U85=\"\",\"\",Input!U85)","v":""},{"$f":"IF(Input!V85=\"\",\"\",Input!V85)","v":""}]
[80,{"$f":"IF( Input!B86=\"\",\"\",Input!B86)","v":""},{"$f":"IF(Input!T86=\"\",\"\",Input!T86)","v":""},{"$f":"IF(Input!AI86=\"\",\"\",Input!AI86)","v":""},{"$f":"IF(Input!AV86=\"\",\"\",Input!AV86)","v":""},{"$f":"IF(Input!U86=\"\",\"\",Input!U86)","v":""},{"$f":"IF(Input!V86=\"\",\"\",Input!V86)","v":""}]
[81,{"$f":"IF( Input!B87=\"\",\"\",Input!B87)","v":""},{"$f":"IF(Input!T87=\"\",\"\",Input!T87)","v":""},{"$f":"IF(Input!AI87=\"\",\"\",Input!AI87)","v":""},{"$f":"IF(Input!AV87=\"\",\"\",Input!AV87)","v":""},{"$f":"IF(Input!U87=\"\",\"\",Input!U87)","v":""},{"$f":"IF(Input!V87=\"\",\"\",Input!V87)","v":""}]
[82,{"$f":"IF( Input!B88=\"\",\"\",Input!B88)","v":""},{"$f":"IF(Input!T88=\"\",\"\",Input!T88)","v":""},{"$f":"IF(Input!AI88=\"\",\"\",Input!AI88)","v":""},{"$f":"IF(Input!AV88=\"\",\"\",Input!AV88)","v":""},{"$f":"IF(Input!U88=\"\",\"\",Input!U88)","v":""},{"$f":"IF(Input!V88=\"\",\"\",Input!V88)","v":""}]
[83,{"$f":"IF( Input!B89=\"\",\"\",Input!B89)","v":""},{"$f":"IF(Input!T89=\"\",\"\",Input!T89)","v":""},{"$f":"IF(Input!AI89=\"\",\"\",Input!AI89)","v":""},{"$f":"IF(Input!AV89=\"\",\"\",Input!AV89)","v":""},{"$f":"IF(Input!U89=\"\",\"\",Input!U89)","v":""},{"$f":"IF(Input!V89=\"\",\"\",Input!V89)","v":""}]
[84,{"$f":"IF( Input!B90=\"\",\"\",Input!B90)","v":""},{"$f":"IF(Input!T90=\"\",\"\",Input!T90)","v":""},{"$f":"IF(Input!AI90=\"\",\"\",Input!AI90)","v":""},{"$f":"IF(Input!AV90=\"\",\"\",Input!AV90)","v":""},{"$f":"IF(Input!U90=\"\",\"\",Input!U90)","v":""},{"$f":"IF(Input!V90=\"\",\"\",Input!V90)","v":""}]
[85,{"$f":"IF( Input!B91=\"\",\"\",Input!B91)","v":""},{"$f":"IF(Input!T91=\"\",\"\",Input!T91)","v":""},{"$f":"IF(Input!AI91=\"\",\"\",Input!AI91)","v":""},{"$f":"IF(Input!AV91=\"\",\"\",Input!AV91)","v":""},{"$f":"IF(Input!U91=\"\",\"\",Input!U91)","v":""},{"$f":"IF(Input!V91=\"\",\"\",Input!V91)","v":""}]
[86,{"$f":"IF( Input!B92=\"\",\"\",Input!B92)","v":""},{"$f":"IF(Input!T92=\"\",\"\",Input!T92)","v":""},{"$f":"IF(Input!AI92=\"\",\"\",Input!AI92)","v":""},{"$f":"IF(Input!AV92=\"\",\"\",Input!AV92)","v":""},{"$f":"IF(Input!U92=\"\",\"\",Input!U92)","v":""},{"$f":"IF(Input!V92=\"\",\"\",Input!V92)","v":""}]
[87,{"$f":"IF( Input!B93=\"\",\"\",Input!B93)","v":""},{"$f":"IF(Input!T93=\"\",\"\",Input!T93)","v":""},{"$f":"IF(Input!AI93=\"\",\"\",Input!AI93)","v":""},{"$f":"IF(Input!AV93=\"\",\"\",Input!AV93)","v":""},{"$f":"IF(Input!U93=\"\",\"\",Input!U93)","v":""},{"$f":"IF(Input!V93=\"\",\"\",Input!V93)","v":""}]
[88,{"$f":"IF( Input!B94=\"\",\"\",Input!B94)","v":""},{"$f":"IF(Input!T94=\"\",\"\",Input!T94)","v":""},{"$f":"IF(Input!AI94=\"\",\"\",Input!AI94)","v":""},{"$f":"IF(Input!AV94=\"\",\"\",Input!AV94)","v":""},{"$f":"IF(Input!U94=\"\",\"\",Input!U94)","v":""},{"$f":"IF(Input!V94=\"\",\"\",Input!V94)","v":""}]
[89,{"$f":"IF( Input!B95=\"\",\"\",Input!B95)","v":""},{"$f":"IF(Input!T95=\"\",\"\",Input!T95)","v":""},{"$f":"IF(Input!AI95=\"\",\"\",Input!AI95)","v":""},{"$f":"IF(Input!AV95=\"\",\"\",Input!AV95)","v":""},{"$f":"IF(Input!U95=\"\",\"\",Input!U95)","v":""},{"$f":"IF(Input!V95=\"\",\"\",Input!V95)","v":""}]
[90,{"$f":"IF( Input!B96=\"\",\"\",Input!B96)","v":""},{"$f":"IF(Input!T96=\"\",\"\",Input!T96)","v":""},{"$f":"IF(Input!AI96=\"\",\"\",Input!AI96)","v":""},{"$f":"IF(Input!AV96=\"\",\"\",Input!AV96)","v":""},{"$f":"IF(Input!U96=\"\",\"\",Input!U96)","v":""},{"$f":"IF(Input!V96=\"\",\"\",Input!V96)","v":""}]
[91,{"$f":"IF( Input!B97=\"\",\"\",Input!B97)","v":""},{"$f":"IF(Input!T97=\"\",\"\",Input!T97)","v":""},{"$f":"IF(Input!AI97=\"\",\"\",Input!AI97)","v":""},{"$f":"IF(Input!AV97=\"\",\"\",Input!AV97)","v":""},{"$f":"IF(Input!U97=\"\",\"\",Input!U97)","v":""},{"$f":"IF(Input!V97=\"\",\"\",Input!V97)","v":""}]
[92,{"$f":"IF( Input!B98=\"\",\"\",Input!B98)","v":""},{"$f":"IF(Input!T98=\"\",\"\",Input!T98)","v":""},{"$f":"IF(Input!AI98=\"\",\"\",Input!AI98)","v":""},{"$f":"IF(Input!AV98=\"\",\"\",Input!AV98)","v":""},{"$f":"IF(Input!U98=\"\",\"\",Input!U98)","v":""},{"$f":"IF(Input!V98=\"\",\"\",Input!V98)","v":""}]
[93,{"$f":"IF( Input!B99=\"\",\"\",Input!B99)","v":""},{"$f":"IF(Input!T99=\"\",\"\",Input!T99)","v":""},{"$f":"IF(Input!AI99=\"\",\"\",Input!AI99)","v":""},{"$f":"IF(Input!AV99=\"\",\"\",Input!AV99)","v":""},{"$f":"IF(Input!U99=\"\",\"\",Input!U99)","v":""},{"$f":"IF(Input!V99=\"\",\"\",Input!V99)","v":""}]
[94,{"$f":"IF( Input!B100=\"\",\"\",Input!B100)","v":""},{"$f":"IF(Input!T100=\"\",\"\",Input!T100)","v":""},{"$f":"IF(Input!AI100=\"\",\"\",Input!AI100)","v":""},{"$f":"IF(Input!AV100=\"\",\"\",Input!AV100)","v":""},{"$f":"IF(Input!U100=\"\",\"\",Input!U100)","v":""},{"$f":"IF(Input!V100=\"\",\"\",Input!V100)","v":""}]
[95,{"$f":"IF( Input!B101=\"\",\"\",Input!B101)","v":""},{"$f":"IF(Input!T101=\"\",\"\",Input!T101)","v":""},{"$f":"IF(Input!AI101=\"\",\"\",Input!AI101)","v":""},{"$f":"IF(Input!AV101=\"\",\"\",Input!AV101)","v":""},{"$f":"IF(Input!U101=\"\",\"\",Input!U101)","v":""},{"$f":"IF(Input!V101=\"\",\"\",Input!V101)","v":""}]
[96,{"$f":"IF( Input!B102=\"\",\"\",Input!B102)","v":""},{"$f":"IF(Input!T102=\"\",\"\",Input!T102)","v":""},{"$f":"IF(Input!AI102=\"\",\"\",Input!AI102)","v":""},{"$f":"IF(Input!AV102=\"\",\"\",Input!AV102)","v":""},{"$f":"IF(Input!U102=\"\",\"\",Input!U102)","v":""},{"$f":"IF(Input!V102=\"\",\"\",Input!V102)","v":""}]
[97,{"$f":"IF( Input!B103=\"\",\"\",Input!B103)","v":""},{"$f":"IF(Input!T103=\"\",\"\",Input!T103)","v":""},{"$f":"IF(Input!AI103=\"\",\"\",Input!AI103)","v":""},{"$f":"IF(Input!AV103=\"\",\"\",Input!AV103)","v":""},{"$f":"IF(Input!U103=\"\",\"\",Input!U103)","v":""},{"$f":"IF(Input!V103=\"\",\"\",Input!V103)","v":""}]
[98,{"$f":"IF( Input!B104=\"\",\"\",Input!B104)","v":""},{"$f":"IF(Input!T104=\"\",\"\",Input!T104)","v":""},{"$f":"IF(Input!AI104=\"\",\"\",Input!AI104)","v":""},{"$f":"IF(Input!AV104=\"\",\"\",Input!AV104)","v":""},{"$f":"IF(Input!U104=\"\",\"\",Input!U104)","v":""},{"$f":"IF(Input!V104=\"\",\"\",Input!V104)","v":""}]
[99,{"$f":"IF( Input!B105=\"\",\"\",Input!B105)","v":""},{"$f":"IF(Input!T105=\"\",\"\",Input!T105)","v":""},{"$f":"IF(Input!AI105=\"\",\"\",Input!AI105)","v":""},{"$f":"IF(Input!AV105=\"\",\"\",Input!AV105)","v":""},{"$f":"IF(Input!U105=\"\",\"\",Input!U105)","v":""},{"$f":"IF(Input!V105=\"\",\"\",Input!V105)","v":""}]
[100,{"$f":"IF( Input!B106=\"\",\"\",Input!B106)","v":""},{"$f":"IF(Input!T106=\"\",\"\",Input!T106)","v":""},{"$f":"IF(Input!AI106=\"\",\"\",Input!AI106)","v":""},{"$f":"IF(Input!AV106=\"\",\"\",Input!AV106)","v":""},{"$f":"IF(Input!U106=\"\",\"\",Input!U106)","v":""},{"$f":"IF(Input!V106=\"\",\"\",Input!V106)","v":""}]

{"sheet":"Report","index":5,"n_rows":120,"n_cols":34,"rows_kept":120,"cut":false,"hidden":true,"merged":[[0,1,0,25],[19,1,19,2],[20,1,20,2],[13,1,13,8],[6,2,6,8],[12,2,12,8],[5,2,5,8],[24,29,24,31],[24,21,24,28],[21,1,21,2],[24,32,24,33],[11,2,11,8],[24,2,24,10],[24,11,24,20],[24,0,24,1]]}
[null,"I declare that:\n1.  I have collected and retained all documentation required to support this ESC calculation\n2.  I have acceptance from the Scheme Administrator for the emerging lighting technology entered into this calculator (If appropriate)\n3.  the RESA has been implemented in accordance with legislative requirements, including safety legislation.\n"]
[null,"Accredited Certificate Provider:","QEWR"]
[null,"Name","QEW"]
[null,"Position","EWQR"]
[null,"Resa ID ","QER"]
[null,"Date ","QEWR"]
[null,"Date of Report Generation:",{"$f":"TODAY()","v":"2023-05-05"}]
[]
[null,"End Use Application:",{"$f":"IF(Input!A1=\"\",\"\",Input!A1)","v":""}]
[null,"Site Name:",{"$f":"IF(Input!A2=\"\",\"\",Input!A2)","v":""}]
[null,"Site Address:",{"$f":"IF(Input!A3=\"\",\"\",Input!A3)","v":""}]
[null,"Implementation ID:",{"$f":"Input!H2","v":0}]
[null,"Implementation Date:",{"$f":"Input!E2","v":"00:00:00"}]
[null,"Original Energy Saver (Purchaser):"]
[null,"Site Contact","TP"]
[null,"Phone: ",0]
[null," E-mail:","tp@tp"]
[]
[]
[null,"Total Energy Savings (MWh)",null,{"$f":"'FRONT PAGE'!E36","v":0}]
[null,"Total ESCs  (Indicative)",null,{"$f":"'FRONT PAGE'!E37","v":0}]
[null,"Regional Network Factor",null,{"$f":"Input!G2","v":0}]
[]
[]
["Area",null,"Original Lighting Equipment",null,null,null,null,null,null,null,null,"Upgraded Lighting Equipment",null,null,null,null,null,null,null,null,null,"Upgrade Parameters",null,null,null,null,null,null,null,"ELT Details",null,null,"Energy Savings"]
[" No","Location Name","No. lamps","Lamp type","Nominal lamp power (W)","Ballast/ transformer type","Lamp Circuit Power (W)","Control system-1","Control system-2","Low Power LCP (W)","Control Multiplier","No. lamps","Lamp type","Nominal Lamp Power (W)","Ballast/ transformer type","Lamp Circuit Power (W)","Control system-1","Control system-2","Low Power LCP (W)","Control Multiplier","Lamp Lifetime (hrs)","Lamp Only Replacement","Control System Only"," ","Annual Operating Hours  (AOH)","Asset Lifetime (yrs)","Space Type","Space Group","Air Conditioning Multiplier (AM)","ELT Brand","ELT Model Number","ELT Acceptance Date","Savings (MWh)","ESCs"]
[{"$f":"IF(B27<>\"\",1,\"\")","v":""},{"$f":"IF( Input!B7=\"\",\"\",Input!B7)","v":""},{"$f":"IF( Input!C7=\"\",\"\",Input!C7)","v":""},{"$f":"IF( Input!E7=\"\",\"\",Input!E7)","v":""},{"$f":"IF( Input!F7=\"\",\"\",Input!F7)","v":""},{"$f":"IF( Input!G7=\"\",\"\",Input!G7)","v":""},{"$f":"IF( Input!F7=\"\",\"\",Input!F7*Input!Y7+Input!Z7)","v":""},{"$f":"IF( Input!H7=\"\",\"\",Input!H7)","v":""},{"$f":"IF( Input!I7=\"\",\"\",Input!I7)","v":""},{"$f":"IF( Input!AH7=\"\",\"\",Input!AH7)","v":""},{"$f":"IF( Input!AF7=\"\",\"\",Input!AF7)","v":1},{"$f":"IF( Input!L7=\"\",\"\",Input!L7)","v":""},{"$f":"IF( Input!N7=\"\",\"\",Input!N7)","v":""},{"$f":"IF( Input!O7=\"\",\"\",Input!O7)","v":""},{"$f":"IF( Input!P7=\"\",\"\",Input!P7)","v":""},{"$f":"IF( Input!O7=\"\",\"\",Input!O7*Input!AL7+Input!AM7)","v":""},{"$f":"IF( Input!Q7=\"\",\"\",Input!Q7)","v":""},{"$f":"IF( Input!R7=\"\",\"\",Input!R7)","v":""},{"$f":"IF( Input!AU7=\"\",\"\",Input!AU7)","v":""},{"$f":"IF( Input!AS7=\"\",\"\",Input!AS7)","v":1},{"$f":"IF( Input!BB7=\"\",\"\",Input!BB7)","v":"N/A"},{"$f":"IF(Input!AY7=\"\",\"\",Input!AY7)","v":"N"},{"$f":"IF(Input!AZ7=\"\",\"\",Input!AZ7)","v":"N"},null,{"$f":"IF(Input!AR7=\"\",\"\",Input!AR7)","v":""},{"$f":"IF(Input!B7=\"\",\"\",(Input!AN7*Input!AP7+Input!AO7*Input!AQ7)/SUM(Input!AN7:AO7))","v":""},{"$f":"IF(Input!K7=\"\",\"\",Input!K7)","v":""},{"$f":"IF(Input!A7=\"\",\"\",Input!A7)","v":""},{"$f":"IF(Input!AT7=\"\",\"\",Input!AT7)","v":""},{"$f":"IF(Input!BC7=\"\",\"\",Input!BC7)","v":"x"},{"$f":"IF(Input!BD7=\"\",\"\",Input!BD7)","v":"x"},{"$f":"IF(Input!BG7=\"\",\"\",Input!BG7)","v":""},{"$f":"IF(Input!AX7=\"\",\"\",Input!AX7)","v":""},{"$f":"IF(Input!V7=\"\",\"\",Input!V7)","v":""}]
[{"$f":"IF(B28<>\"\",1,\"\")","v":""},{"$f":"IF( Input!B8=\"\",\"\",Input!B8)","v":""},{"$f":"IF( Input!C8=\"\",\"\",Input!C8)","v":""},{"$f":"IF( Input!E8=\"\",\"\",Input!E8)","v":""},{"$f":"IF( Input!F8=\"\",\"\",Input!F8)","v":""},{"$f":"IF( Input!G8=\"\",\"\",Input!G8)","v":""},{"$f":"IF( Input!F8=\"\",\"\",Input!F8*Input!Y8+Input!Z8)","v":""},{"$f":"IF( Input!H8=\"\",\"\",Input!H8)","v":""},{"$f":"IF( Input!I8=\"\",\"\",Input!I8)","v":""},{"$f":"IF( Input!AH8=\"\",\"\",Input!AH8)","v":""},{"$f":"IF( Input!AF8=\"\",\"\",Input!AF8)","v":1},{"$f":"IF( Input!L8=\"\",\"\",Input!L8)","v":""},{"$f":"IF( Input!N8=\"\",\"\",Input!N8)","v":""},{"$f":"IF( Input!O8=\"\",\"\",Input!O8)","v":""},{"$f":"IF( Input!P8=\"\",\"\",Input!P8)","v":""},{"$f":"IF( Input!O8=\"\",\"\",Input!O8*Input!AL8+Input!AM8)","v":""},{"$f":"IF( Input!Q8=\"\",\"\",Input!Q8)","v":""},{"$f":"IF( Input!R8=\"\",\"\",Input!R8)","v":""},{"$f":"IF( Input!AU8=\"\",\"\",Input!AU8)","v":""},{"$f":"IF( Input!AS8=\"\",\"\",Input!AS8)","v":1},{"$f":"IF( Input!BB8=\"\",\"\",Input!BB8)","v":"N/A"},{"$f":"IF(Input!AY8=\"\",\"\",Input!AY8)","v":"N"},{"$f":"IF(Input!AZ8=\"\",\"\",Input!AZ8)","v":"N"},null,{"$f":"IF(Input!AR8=\"\",\"\",Input!AR8)","v":""},{"$f":"IF(Input!B8=\"\",\"\",(Input!AN8*Input!AP8+Input!AO8*Input!AQ8)/SUM(Input!AN8:AO8))","v":""},{"$f":"IF(Input!K8=\"\",\"\",Input!K8)","v":""},{"$f":"IF(Input!A8=\"\",\"\",Input!A8)","v":""},{"$f":"IF(Input!AT8=\"\",\"\",Input!AT8)","v":""},{"$f":"IF(Input!BC8=\"\",\"\",Input!BC8)","v":"u"},{"$f":"IF(Input!BD8=\"\",\"\",Input!BD8)","v":"u"},{"$f":"IF(Input!BG8=\"\",\"\",Input!BG8)","v":""},{"$f":"IF(Input!AX8=\"\",\"\",Input!AX8)","v":""},{"$f":"IF(Input!V8=\"\",\"\",Input!V8)","v":""}]
["",{"$f":"IF( Input!B9=\"\",\"\",Input!B9)","v":""},{"$f":"IF( Input!C9=\"\",\"\",Input!C9)","v":""},{"$f":"IF( Input!E9=\"\",\"\",Input!E9)","v":""},{"$f":"IF( Input!F9=\"\",\"\",Input!F9)","v":""},{"$f":"IF( Input!G9=\"\",\"\",Input!G9)","v":""},{"$f":"IF( Input!F9=\"\",\"\",Input!F9*Input!Y9+Input!Z9)","v":""},{"$f":"IF( Input!H9=\"\",\"\",Input!H9)","v":""},{"$f":"IF( Input!I9=\"\",\"\",Input!I9)","v":""},{"$f":"IF( Input!AH9=\"\",\"\",Input!AH9)","v":""},{"$f":"IF( Input!AF9=\"\",\"\",Input!AF9)","v":""},{"$f":"IF( Input!L9=\"\",\"\",Input!L9)","v":""},{"$f":"IF( Input!N9=\"\",\"\",Input!N9)","v":""},{"$f":"IF( Input!O9=\"\",\"\",Input!O9)","v":""},{"$f":"IF( Input!P9=\"\",\"\",Input!P9)","v":""},{"$f":"IF( Input!O9=\"\",\"\",Input!O9*Input!AL9+Input!AM9)","v":""},{"$f":"IF( Input!Q9=\"\",\"\",Input!Q9)","v":""},{"$f":"IF( Input!R9=\"\",\"\",Input!R9)","v":""},{"$f":"IF( Input!AU9=\"\",\"\",Input!AU9)","v":""},{"$f":"IF( Input!AS9=\"\",\"\",Input!AS9)","v":""},{"$f":"IF( Input!BB9=\"\",\"\",Input!BB9)","v":""},{"$f":"IF(Input!AY9=\"\",\"\",Input!AY9)","v":""},{"$f":"IF(Input!AZ9=\"\",\"\",Input!AZ9)","v":""},null,{"$f":"IF(Input!AR9=\"\",\"\",Input!AR9)","v":""},{"$f":"IF(Input!B9=\"\",\"\",(Input!AN9*Input!AP9+Input!AO9*Input!AQ9)/SUM(Input!AN9:AO9))","v":""},{"$f":"IF(Input!K9=\"\",\"\",Input!K9)","v":""},{"$f":"IF(Input!A9=\"\",\"\",Input!A9)","v":""},{"$f":"IF(Input!AT9=\"\",\"\",Input!AT9)","v":""},{"$f":"IF(Input!BC9=\"\",\"\",Input!BC9)","v":""},{"$f":"IF(Input!BD9=\"\",\"\",Input!BD9)","v":""},{"$f":"IF(Input!BG9=\"\",\"\",Input!BG9)","v":""},{"$f":"IF(Input!AX9=\"\",\"\",Input!AX9)","v":""},{"$f":"IF(Input!V9=\"\",\"\",Input!V9)","v":""}]
["",{"$f":"IF( Input!B10=\"\",\"\",Input!B10)","v":""},{"$f":"IF( Input!C10=\"\",\"\",Input!C10)","v":""},{"$f":"IF( Input!E10=\"\",\"\",Input!E10)","v":""},{"$f":"IF( Input!F10=\"\",\"\",Input!F10)","v":""},{"$f":"IF( Input!G10=\"\",\"\",Input!G10)","v":""},{"$f":"IF( Input!F10=\"\",\"\",Input!F10*Input!Y10+Input!Z10)","v":""},{"$f":"IF( Input!H10=\"\",\"\",Input!H10)","v":""},{"$f":"IF( Input!I10=\"\",\"\",Input!I10)","v":""},{"$f":"IF( Input!AH10=\"\",\"\",Input!AH10)","v":""},{"$f":"IF( Input!AF10=\"\",\"\",Input!AF10)","v":""},{"$f":"IF( Input!L10=\"\",\"\",Input!L10)","v":""},{"$f":"IF( Input!N10=\"\",\"\",Input!N10)","v":""},{"$f":"IF( Input!O10=\"\",\"\",Input!O10)","v":""},{"$f":"IF( Input!P10=\"\",\"\",Input!P10)","v":""},{"$f":"IF( Input!O10=\"\",\"\",Input!O10*Input!AL10+Input!AM10)","v":""},{"$f":"IF( Input!Q10=\"\",\"\",Input!Q10)","v":""},{"$f":"IF( Input!R10=\"\",\"\",Input!R10)","v":""},{"$f":"IF( Input!AU10=\"\",\"\",Input!AU10)","v":""},{"$f":"IF( Input!AS10=\"\",\"\",Input!AS10)","v":""},{"$f":"IF( Input!BB10=\"\",\"\",Input!BB10)","v":""},{"$f":"IF(Input!AY10=\"\",\"\",Input!AY10)","v":""},{"$f":"IF(Input!AZ10=\"\",\"\",Input!AZ10)","v":""},null,{"$f":"IF(Input!AR10=\"\",\"\",Input!AR10)","v":""},{"$f":"IF(Input!B10=\"\",\"\",(Input!AN10*Input!AP10+Input!AO10*Input!AQ10)/SUM(Input!AN10:AO10))","v":""},{"$f":"IF(Input!K10=\"\",\"\",Input!K10)","v":""},{"$f":"IF(Input!A10=\"\",\"\",Input!A10)","v":""},{"$f":"IF(Input!AT10=\"\",\"\",Input!AT10)","v":""},{"$f":"IF(Input!BC10=\"\",\"\",Input!BC10)","v":""},{"$f":"IF(Input!BD10=\"\",\"\",Input!BD10)","v":""},{"$f":"IF(Input!BG10=\"\",\"\",Input!BG10)","v":""},{"$f":"IF(Input!AX10=\"\",\"\",Input!AX10)","v":""},{"$f":"IF(Input!V10=\"\",\"\",Input!V10)","v":""}]
["",{"$f":"IF( Input!B11=\"\",\"\",Input!B11)","v":""},{"$f":"IF( Input!C11=\"\",\"\",Input!C11)","v":""},{"$f":"IF( Input!E11=\"\",\"\",Input!E11)","v":""},{"$f":"IF( Input!F11=\"\",\"\",Input!F11)","v":""},{"$f":"IF( Input!G11=\"\",\"\",Input!G11)","v":""},{"$f":"IF( Input!F11=\"\",\"\",Input!F11*Input!Y11+Input!Z11)","v":""},{"$f":"IF( Input!H11=\"\",\"\",Input!H11)","v":""},{"$f":"IF( Input!I11=\"\",\"\",Input!I11)","v":""},{"$f":"IF( Input!AH11=\"\",\"\",Input!AH11)","v":""},{"$f":"IF( Input!AF11=\"\",\"\",Input!AF11)","v":""},{"$f":"IF( Input!L11=\"\",\"\",Input!L11)","v":""},{"$f":"IF( Input!N11=\"\",\"\",Input!N11)","v":""},{"$f":"IF( Input!O11=\"\",\"\",Input!O11)","v":""},{"$f":"IF( Input!P11=\"\",\"\",Input!P11)","v":""},{"$f":"IF( Input!O11=\"\",\"\",Input!O11*Input!AL11+Input!AM11)","v":""},{"$f":"IF( Input!Q11=\"\",\"\",Input!Q11)","v":""},{"$f":"IF( Input!R11=\"\",\"\",Input!R11)","v":""},{"$f":"IF( Input!AU11=\"\",\"\",Input!AU11)","v":""},{"$f":"IF( Input!AS11=\"\",\"\",Input!AS11)","v":""},{"$f":"IF( Input!BB11=\"\",\"\",Input!BB11)","v":""},{"$f":"IF(Input!AY11=\"\",\"\",Input!AY11)","v":""},{"$f":"IF(Input!AZ11=\"\",\"\",Input!AZ11)","v":""},null,{"$f":"IF(Input!AR11=\"\",\"\",Input!AR11)","v":""},{"$f":"IF(Input!B11=\"\",\"\",(Input!AN11*Input!AP11+Input!AO11*Input!AQ11)/SUM(Input!AN11:AO11))","v":""},{"$f":"IF(Input!K11=\"\",\"\",Input!K11)","v":""},{"$f":"IF(Input!A11=\"\",\"\",Input!A11)","v":""},{"$f":"IF(Input!AT11=\"\",\"\",Input!AT11)","v":""},{"$f":"IF(Input!BC11=\"\",\"\",Input!BC11)","v":""},{"$f":"IF(Input!BD11=\"\",\"\",Input!BD11)","v":""},{"$f":"IF(Input!BG11=\"\",\"\",Input!BG11)","v":""},{"$f":"IF(Input!AX11=\"\",\"\",Input!AX11)","v":""},{"$f":"IF(Input!V11=\"\",\"\",Input!V11)","v":""}]
["",{"$f":"IF( Input!B12=\"\",\"\",Input!B12)","v":""},{"$f":"IF( Input!C12=\"\",\"\",Input!C12)","v":""},{"$f":"IF( Input!E12=\"\",\"\",Input!E12)","v":""},{"$f":"IF( Input!F12=\"\",\"\",Input!F12)","v":""},{"$f":"IF( Input!G12=\"\",\"\",Input!G12)","v":""},{"$f":"IF( Input!F12=\"\",\"\",Input!F12*Input!Y12+Input!Z12)","v":""},{"$f":"IF( Input!H12=\"\",\"\",Input!H12)","v":""},{"$f":"IF( Input!I12=\"\",\"\",Input!I12)","v":""},{"$f":"IF( Input!AH12=\"\",\"\",Input!AH12)","v":""},{"$f":"IF( Input!AF12=\"\",\"\",Input!AF12)","v":""},{"$f":"IF( Input!L12=\"\",\"\",Input!L12)","v":""},{"$f":"IF( Input!N12=\"\",\"\",Input!N12)","v":""},{"$f":"IF( Input!O12=\"\",\"\",Input!O12)","v":""},{"$f":"IF( Input!P12=\"\",\"\",Input!P12)","v":""},{"$f":"IF( Input!O12=\"\",\"\",Input!O12*Input!AL12+Input!AM12)","v":""},{"$f":"IF( Input!Q12=\"\",\"\",Input!Q12)","v":""},{"$f":"IF( Input!R12=\"\",\"\",Input!R12)","v":""},{"$f":"IF( Input!AU12=\"\",\"\",Input!AU12)","v":""},{"$f":"IF( Input!AS12=\"\",\"\",Input!AS12)","v":""},{"$f":"IF( Input!BB12=\"\",\"\",Input!BB12)","v":""},{"$f":"IF(Input!AY12=\"\",\"\",Input!AY12)","v":""},{"$f":"IF(Input!AZ12=\"\",\"\",Input!AZ12)","v":""},null,{"$f":"IF(Input!AR12=\"\",\"\",Input!AR12)","v":""},{"$f":"IF(Input!B12=\"\",\"\",(Input!AN12*Input!AP12+Input!AO12*Input!AQ12)/SUM(Input!AN12:AO12))","v":""},{"$f":"IF(Input!K12=\"\",\"\",Input!K12)","v":""},{"$f":"IF(Input!A12=\"\",\"\",Input!A12)","v":""},{"$f":"IF(Input!AT12=\"\",\"\",Input!AT12)","v":""},{"$f":"IF(Input!BC12=\"\",\"\",Input!BC12)","v":""},{"$f":"IF(Input!BD12=\"\",\"\",Input!BD12)","v":""},{"$f":"IF(Input!BG12=\"\",\"\",Input!BG12)","v":""},{"$f":"IF(Input!AX12=\"\",\"\",Input!AX12)","v":""},{"$f":"IF(Input!V12=\"\",\"\",Input!V12)","v":""}]
["",{"$f":"IF( Input!B13=\"\",\"\",Input!B13)","v":""},{"$f":"IF( Input!C13=\"\",\"\",Input!C13)","v":""},{"$f":"IF( Input!E13=\"\",\"\",Input!E13)","v":""},{"$f":"IF( Input!F13=\"\",\"\",Input!F13)","v":""},{"$f":"IF( Input!G13=\"\",\"\",Input!G13)","v":""},{"$f":"IF( Input!F13=\"\",\"\",Input!F13*Input!Y13+Input!Z13)","v":""},{"$f":"IF( Input!H13=\"\",\"\",Input!H13)","v":""},{"$f":"IF( Input!I13=\"\",\"\",Input!I13)","v":""},{"$f":"IF( Input!AH13=\"\",\"\",Input!AH13)","v":""},{"$f":"IF( Input!AF13=\"\",\"\",Input!AF13)","v":""},{"$f":"IF( Input!L13=\"\",\"\",Input!L13)","v":""},{"$f":"IF( Input!N13=\"\",\"\",Input!N13)","v":""},{"$f":"IF( Input!O13=\"\",\"\",Input!O13)","v":""},{"$f":"IF( Input!P13=\"\",\"\",Input!P13)","v":""},{"$f":"IF( Input!O13=\"\",\"\",Input!O13*Input!AL13+Input!AM13)","v":""},{"$f":"IF( Input!Q13=\"\",\"\",Input!Q13)","v":""},{"$f":"IF( Input!R13=\"\",\"\",Input!R13)","v":""},{"$f":"IF( Input!AU13=\"\",\"\",Input!AU13)","v":""},{"$f":"IF( Input!AS13=\"\",\"\",Input!AS13)","v":""},{"$f":"IF( Input!BB13=\"\",\"\",Input!BB13)","v":""},{"$f":"IF(Input!AY13=\"\",\"\",Input!AY13)","v":""},{"$f":"IF(Input!AZ13=\"\",\"\",Input!AZ13)","v":""},null,{"$f":"IF(Input!AR13=\"\",\"\",Input!AR13)","v":""},{"$f":"IF(Input!B13=\"\",\"\",(Input!AN13*Input!AP13+Input!AO13*Input!AQ13)/SUM(Input!AN13:AO13))","v":""},{"$f":"IF(Input!K13=\"\",\"\",Input!K13)","v":""},{"$f":"IF(Input!A13=\"\",\"\",Input!A13)","v":""},{"$f":"IF(Input!AT13=\"\",\"\",Input!AT13)","v":""},{"$f":"IF(Input!BC13=\"\",\"\",Input!BC13)","v":""},{"$f":"IF(Input!BD13=\"\",\"\",Input!BD13)","v":""},{"$f":"IF(Input!BG13=\"\",\"\",Input!BG13)","v":""},{"$f":"IF(Input!AX13=\"\",\"\",Input!AX13)","v":""},{"$f":"IF(Input!V13=\"\",\"\",Input!V13)","v":""}]
["",{"$f":"IF( Input!B14=\"\",\"\",Input!B14)","v":""},{"$f":"IF( Input!C14=\"\",\"\",Input!C14)","v":""},{"$f":"IF( Input!E14=\"\",\"\",Input!E14)","v":""},{"$f":"IF( Input!F14=\"\",\"\",Input!F14)","v":""},{"$f":"IF( Input!G14=\"\",\"\",Input!G14)","v":""},{"$f":"IF( Input!F14=\"\",\"\",Input!F14*Input!Y14+Input!Z14)","v":""},{"$f":"IF( Input!H14=\"\",\"\",Input!H14)","v":""},{"$f":"IF( Input!I14=\"\",\"\",Input!I14)","v":""},{"$f":"IF( Input!AH14=\"\",\"\",Input!AH14)","v":""},{"$f":"IF( Input!AF14=\"\",\"\",Input!AF14)","v":""},{"$f":"IF( Input!L14=\"\",\"\",Input!L14)","v":""},{"$f":"IF( Input!N14=\"\",\"\",Input!N14)","v":""},{"$f":"IF( Input!O14=\"\",\"\",Input!O14)","v":""},{"$f":"IF( Input!P14=\"\",\"\",Input!P14)","v":""},{"$f":"IF( Input!O14=\"\",\"\",Input!O14*Input!AL14+Input!AM14)","v":""},{"$f":"IF( Input!Q14=\"\",\"\",Input!Q14)","v":""},{"$f":"IF( Input!R14=\"\",\"\",Input!R14)","v":""},{"$f":"IF( Input!AU14=\"\",\"\",Input!AU14)","v":""},{"$f":"IF( Input!AS14=\"\",\"\",Input!AS14)","v":""},{"$f":"IF( Input!BB14=\"\",\"\",Input!BB14)","v":""},{"$f":"IF(Input!AY14=\"\",\"\",Input!AY14)","v":""},{"$f":"IF(Input!AZ14=\"\",\"\",Input!AZ14)","v":""},null,{"$f":"IF(Input!AR14=\"\",\"\",Input!AR14)","v":""},{"$f":"IF(Input!B14=\"\",\"\",(Input!AN14*Input!AP14+Input!AO14*Input!AQ14)/SUM(Input!AN14:AO14))","v":""},{"$f":"IF(Input!K14=\"\",\"\",Input!K14)","v":""},{"$f":"IF(Input!A14=\"\",\"\",Input!A14)","v":""},{"$f":"IF(Input!AT14=\"\",\"\",Input!AT14)","v":""},{"$f":"IF(Input!BC14=\"\",\"\",Input!BC14)","v":""},{"$f":"IF(Input!BD14=\"\",\"\",Input!BD14)","v":""},{"$f":"IF(Input!BG14=\"\",\"\",Input!BG14)","v":""},{"$f":"IF(Input!AX14=\"\",\"\",Input!AX14)","v":""},{"$f":"IF(Input!V14=\"\",\"\",Input!V14)","v":""}]
["",{"$f":"IF( Input!B15=\"\",\"\",Input!B15)","v":""},{"$f":"IF( Input!C15=\"\",\"\",Input!C15)","v":""},{"$f":"IF( Input!E15=\"\",\"\",Input!E15)","v":""},{"$f":"IF( Input!F15=\"\",\"\",Input!F15)","v":""},{"$f":"IF( Input!G15=\"\",\"\",Input!G15)","v":""},{"$f":"IF( Input!F15=\"\",\"\",Input!F15*Input!Y15+Input!Z15)","v":""},{"$f":"IF( Input!H15=\"\",\"\",Input!H15)","v":""},{"$f":"IF( Input!I15=\"\",\"\",Input!I15)","v":""},{"$f":"IF( Input!AH15=\"\",\"\",Input!AH15)","v":""},{"$f":"IF( Input!AF15=\"\",\"\",Input!AF15)","v":""},{"$f":"IF( Input!L15=\"\",\"\",Input!L15)","v":""},{"$f":"IF( Input!N15=\"\",\"\",Input!N15)","v":""},{"$f":"IF( Input!O15=\"\",\"\",Input!O15)","v":""},{"$f":"IF( Input!P15=\"\",\"\",Input!P15)","v":""},{"$f":"IF( Input!O15=\"\",\"\",Input!O15*Input!AL15+Input!AM15)","v":""},{"$f":"IF( Input!Q15=\"\",\"\",Input!Q15)","v":""},{"$f":"IF( Input!R15=\"\",\"\",Input!R15)","v":""},{"$f":"IF( Input!AU15=\"\",\"\",Input!AU15)","v":""},{"$f":"IF( Input!AS15=\"\",\"\",Input!AS15)","v":""},{"$f":"IF( Input!BB15=\"\",\"\",Input!BB15)","v":""},{"$f":"IF(Input!AY15=\"\",\"\",Input!AY15)","v":""},{"$f":"IF(Input!AZ15=\"\",\"\",Input!AZ15)","v":""},null,{"$f":"IF(Input!AR15=\"\",\"\",Input!AR15)","v":""},{"$f":"IF(Input!B15=\"\",\"\",(Input!AN15*Input!AP15+Input!AO15*Input!AQ15)/SUM(Input!AN15:AO15))","v":""},{"$f":"IF(Input!K15=\"\",\"\",Input!K15)","v":""},{"$f":"IF(Input!A15=\"\",\"\",Input!A15)","v":""},{"$f":"IF(Input!AT15=\"\",\"\",Input!AT15)","v":""},{"$f":"IF(Input!BC15=\"\",\"\",Input!BC15)","v":""},{"$f":"IF(Input!BD15=\"\",\"\",Input!BD15)","v":""},{"$f":"IF(Input!BG15=\"\",\"\",Input!BG15)","v":""},{"$f":"IF(Input!AX15=\"\",\"\",Input!AX15)","v":""},{"$f":"IF(Input!V15=\"\",\"\",Input!V15)","v":""}]
["",{"$f":"IF( Input!B16=\"\",\"\",Input!B16)","v":""},{"$f":"IF( Input!C16=\"\",\"\",Input!C16)","v":""},{"$f":"IF( Input!E16=\"\",\"\",Input!E16)","v":""},{"$f":"IF( Input!F16=\"\",\"\",Input!F16)","v":""},{"$f":"IF( Input!G16=\"\",\"\",Input!G16)","v":""},{"$f":"IF( Input!F16=\"\",\"\",Input!F16*Input!Y16+Input!Z16)","v":""},{"$f":"IF( Input!H16=\"\",\"\",Input!H16)","v":""},{"$f":"IF( Input!I16=\"\",\"\",Input!I16)","v":""},{"$f":"IF( Input!AH16=\"\",\"\",Input!AH16)","v":""},{"$f":"IF( Input!AF16=\"\",\"\",Input!AF16)","v":""},{"$f":"IF( Input!L16=\"\",\"\",Input!L16)","v":""},{"$f":"IF( Input!N16=\"\",\"\",Input!N16)","v":""},{"$f":"IF( Input!O16=\"\",\"\",Input!O16)","v":""},{"$f":"IF( Input!P16=\"\",\"\",Input!P16)","v":""},{"$f":"IF( Input!O16=\"\",\"\",Input!O16*Input!AL16+Input!AM16)","v":""},{"$f":"IF( Input!Q16=\"\",\"\",Input!Q16)","v":""},{"$f":"IF( Input!R16=\"\",\"\",Input!R16)","v":""},{"$f":"IF( Input!AU16=\"\",\"\",Input!AU16)","v":""},{"$f":"IF( Input!AS16=\"\",\"\",Input!AS16)","v":""},{"$f":"IF( Input!BB16=\"\",\"\",Input!BB16)","v":""},{"$f":"IF(Input!AY16=\"\",\"\",Input!AY16)","v":""},{"$f":"IF(Input!AZ16=\"\",\"\",Input!AZ16)","v":""},null,{"$f":"IF(Input!AR16=\"\",\"\",Input!AR16)","v":""},{"$f":"IF(Input!B16=\"\",\"\",(Input!AN16*Input!AP16+Input!AO16*Input!AQ16)/SUM(Input!AN16:AO16))","v":""},{"$f":"IF(Input!K16=\"\",\"\",Input!K16)","v":""},{"$f":"IF(Input!A16=\"\",\"\",Input!A16)","v":""},{"$f":"IF(Input!AT16=\"\",\"\",Input!AT16)","v":""},{"$f":"IF(Input!BC16=\"\",\"\",Input!BC16)","v":""},{"$f":"IF(Input!BD16=\"\",\"\",Input!BD16)","v":""},{"$f":"IF(Input!BG16=\"\",\"\",Input!BG16)","v":""},{"$f":"IF(Input!AX16=\"\",\"\",Input!AX16)","v":""},{"$f":"IF(Input!V16=\"\",\"\",Input!V16)","v":""}]
["",{"$f":"IF( Input!B17=\"\",\"\",Input!B17)","v":""},{"$f":"IF( Input!C17=\"\",\"\",Input!C17)","v":""},{"$f":"IF( Input!E17=\"\",\"\",Input!E17)","v":""},{"$f":"IF( Input!F17=\"\",\"\",Input!F17)","v":""},{"$f":"IF( Input!G17=\"\",\"\",Input!G17)","v":""},{"$f":"IF( Input!F17=\"\",\"\",Input!F17*Input!Y17+Input!Z17)","v":""},{"$f":"IF( Input!H17=\"\",\"\",Input!H17)","v":""},{"$f":"IF( Input!I17=\"\",\"\",Input!I17)","v":""},{"$f":"IF( Input!AH17=\"\",\"\",Input!AH17)","v":""},{"$f":"IF( Input!AF17=\"\",\"\",Input!AF17)","v":""},{"$f":"IF( Input!L17=\"\",\"\",Input!L17)","v":""},{"$f":"IF( Input!N17=\"\",\"\",Input!N17)","v":""},{"$f":"IF( Input!O17=\"\",\"\",Input!O17)","v":""},{"$f":"IF( Input!P17=\"\",\"\",Input!P17)","v":""},{"$f":"IF( Input!O17=\"\",\"\",Input!O17*Input!AL17+Input!AM17)","v":""},{"$f":"IF( Input!Q17=\"\",\"\",Input!Q17)","v":""},{"$f":"IF( Input!R17=\"\",\"\",Input!R17)","v":""},{"$f":"IF( Input!AU17=\"\",\"\",Input!AU17)","v":""},{"$f":"IF( Input!AS17=\"\",\"\",Input!AS17)","v":""},{"$f":"IF( Input!BB17=\"\",\"\",Input!BB17)","v":""},{"$f":"IF(Input!AY17=\"\",\"\",Input!AY17)","v":""},{"$f":"IF(Input!AZ17=\"\",\"\",Input!AZ17)","v":""},null,{"$f":"IF(Input!AR17=\"\",\"\",Input!AR17)","v":""},{"$f":"IF(Input!B17=\"\",\"\",(Input!AN17*Input!AP17+Input!AO17*Input!AQ17)/SUM(Input!AN17:AO17))","v":""},{"$f":"IF(Input!K17=\"\",\"\",Input!K17)","v":""},{"$f":"IF(Input!A17=\"\",\"\",Input!A17)","v":""},{"$f":"IF(Input!AT17=\"\",\"\",Input!AT17)","v":""},{"$f":"IF(Input!BC17=\"\",\"\",Input!BC17)","v":""},{"$f":"IF(Input!BD17=\"\",\"\",Input!BD17)","v":""},{"$f":"IF(Input!BG17=\"\",\"\",Input!BG17)","v":""},{"$f":"IF(Input!AX17=\"\",\"\",Input!AX17)","v":""},{"$f":"IF(Input!V17=\"\",\"\",Input!V17)","v":""}]
["",{"$f":"IF( Input!B18=\"\",\"\",Input!B18)","v":""},{"$f":"IF( Input!C18=\"\",\"\",Input!C18)","v":""},{"$f":"IF( Input!E18=\"\",\"\",Input!E18)","v":""},{"$f":"IF( Input!F18=\"\",\"\",Input!F18)","v":""},{"$f":"IF( Input!G18=\"\",\"\",Input!G18)","v":""},{"$f":"IF( Input!F18=\"\",\"\",Input!F18*Input!Y18+Input!Z18)","v":""},{"$f":"IF( Input!H18=\"\",\"\",Input!H18)","v":""},{"$f":"IF( Input!I18=\"\",\"\",Input!I18)","v":""},{"$f":"IF( Input!AH18=\"\",\"\",Input!AH18)","v":""},{"$f":"IF( Input!AF18=\"\",\"\",Input!AF18)","v":""},{"$f":"IF( Input!L18=\"\",\"\",Input!L18)","v":""},{"$f":"IF( Input!N18=\"\",\"\",Input!N18)","v":""},{"$f":"IF( Input!O18=\"\",\"\",Input!O18)","v":""},{"$f":"IF( Input!P18=\"\",\"\",Input!P18)","v":""},{"$f":"IF( Input!O18=\"\",\"\",Input!O18*Input!AL18+Input!AM18)","v":""},{"$f":"IF( Input!Q18=\"\",\"\",Input!Q18)","v":""},{"$f":"IF( Input!R18=\"\",\"\",Input!R18)","v":""},{"$f":"IF( Input!AU18=\"\",\"\",Input!AU18)","v":""},{"$f":"IF( Input!AS18=\"\",\"\",Input!AS18)","v":""},{"$f":"IF( Input!BB18=\"\",\"\",Input!BB18)","v":""},{"$f":"IF(Input!AY18=\"\",\"\",Input!AY18)","v":""},{"$f":"IF(Input!AZ18=\"\",\"\",Input!AZ18)","v":""},null,{"$f":"IF(Input!AR18=\"\",\"\",Input!AR18)","v":""},{"$f":"IF(Input!B18=\"\",\"\",(Input!AN18*Input!AP18+Input!AO18*Input!AQ18)/SUM(Input!AN18:AO18))","v":""},{"$f":"IF(Input!K18=\"\",\"\",Input!K18)","v":""},{"$f":"IF(Input!A18=\"\",\"\",Input!A18)","v":""},{"$f":"IF(Input!AT18=\"\",\"\",Input!AT18)","v":""},{"$f":"IF(Input!BC18=\"\",\"\",Input!BC18)","v":""},{"$f":"IF(Input!BD18=\"\",\"\",Input!BD18)","v":""},{"$f":"IF(Input!BG18=\"\",\"\",Input!BG18)","v":""},{"$f":"IF(Input!AX18=\"\",\"\",Input!AX18)","v":""},{"$f":"IF(Input!V18=\"\",\"\",Input!V18)","v":""}]
["",{"$f":"IF( Input!B19=\"\",\"\",Input!B19)","v":""},{"$f":"IF( Input!C19=\"\",\"\",Input!C19)","v":""},{"$f":"IF( Input!E19=\"\",\"\",Input!E19)","v":""},{"$f":"IF( Input!F19=\"\",\"\",Input!F19)","v":""},{"$f":"IF( Input!G19=\"\",\"\",Input!G19)","v":""},{"$f":"IF( Input!F19=\"\",\"\",Input!F19*Input!Y19+Input!Z19)","v":""},{"$f":"IF( Input!H19=\"\",\"\",Input!H19)","v":""},{"$f":"IF( Input!I19=\"\",\"\",Input!I19)","v":""},{"$f":"IF( Input!AH19=\"\",\"\",Input!AH19)","v":""},{"$f":"IF( Input!AF19=\"\",\"\",Input!AF19)","v":""},{"$f":"IF( Input!L19=\"\",\"\",Input!L19)","v":""},{"$f":"IF( Input!N19=\"\",\"\",Input!N19)","v":""},{"$f":"IF( Input!O19=\"\",\"\",Input!O19)","v":""},{"$f":"IF( Input!P19=\"\",\"\",Input!P19)","v":""},{"$f":"IF( Input!O19=\"\",\"\",Input!O19*Input!AL19+Input!AM19)","v":""},{"$f":"IF( Input!Q19=\"\",\"\",Input!Q19)","v":""},{"$f":"IF( Input!R19=\"\",\"\",Input!R19)","v":""},{"$f":"IF( Input!AU19=\"\",\"\",Input!AU19)","v":""},{"$f":"IF( Input!AS19=\"\",\"\",Input!AS19)","v":""},{"$f":"IF( Input!BB19=\"\",\"\",Input!BB19)","v":""},{"$f":"IF(Input!AY19=\"\",\"\",Input!AY19)","v":""},{"$f":"IF(Input!AZ19=\"\",\"\",Input!AZ19)","v":""},null,{"$f":"IF(Input!AR19=\"\",\"\",Input!AR19)","v":""},{"$f":"IF(Input!B19=\"\",\"\",(Input!AN19*Input!AP19+Input!AO19*Input!AQ19)/SUM(Input!AN19:AO19))","v":""},{"$f":"IF(Input!K19=\"\",\"\",Input!K19)","v":""},{"$f":"IF(Input!A19=\"\",\"\",Input!A19)","v":""},{"$f":"IF(Input!AT19=\"\",\"\",Input!AT19)","v":""},{"$f":"IF(Input!BC19=\"\",\"\",Input!BC19)","v":""},{"$f":"IF(Input!BD19=\"\",\"\",Input!BD19)","v":""},{"$f":"IF(Input!BG19=\"\",\"\",Input!BG19)","v":""},{"$f":"IF(Input!AX19=\"\",\"\",Input!AX19)","v":""},{"$f":"IF(Input!V19=\"\",\"\",Input!V19)","v":""}]
["",{"$f":"IF( Input!B20=\"\",\"\",Input!B20)","v":""},{"$f":"IF( Input!C20=\"\",\"\",Input!C20)","v":""},{"$f":"IF( Input!E20=\"\",\"\",Input!E20)","v":""},{"$f":"IF( Input!F20=\"\",\"\",Input!F20)","v":""},{"$f":"IF( Input!G20=\"\",\"\",Input!G20)","v":""},{"$f":"IF( Input!F20=\"\",\"\",Input!F20*Input!Y20+Input!Z20)","v":""},{"$f":"IF( Input!H20=\"\",\"\",Input!H20)","v":""},{"$f":"IF( Input!I20=\"\",\"\",Input!I20)","v":""},{"$f":"IF( Input!AH20=\"\",\"\",Input!AH20)","v":""},{"$f":"IF( Input!AF20=\"\",\"\",Input!AF20)","v":""},{"$f":"IF( Input!L20=\"\",\"\",Input!L20)","v":""},{"$f":"IF( Input!N20=\"\",\"\",Input!N20)","v":""},{"$f":"IF( Input!O20=\"\",\"\",Input!O20)","v":""},{"$f":"IF( Input!P20=\"\",\"\",Input!P20)","v":""},{"$f":"IF( Input!O20=\"\",\"\",Input!O20*Input!AL20+Input!AM20)","v":""},{"$f":"IF( Input!Q20=\"\",\"\",Input!Q20)","v":""},{"$f":"IF( Input!R20=\"\",\"\",Input!R20)","v":""},{"$f":"IF( Input!AU20=\"\",\"\",Input!AU20)","v":""},{"$f":"IF( Input!AS20=\"\",\"\",Input!AS20)","v":""},{"$f":"IF( Input!BB20=\"\",\"\",Input!BB20)","v":""},{"$f":"IF(Input!AY20=\"\",\"\",Input!AY20)","v":""},{"$f":"IF(Input!AZ20=\"\",\"\",Input!AZ20)","v":""},null,{"$f":"IF(Input!AR20=\"\",\"\",Input!AR20)","v":""},{"$f":"IF(Input!B20=\"\",\"\",(Input!AN20*Input!AP20+Input!AO20*Input!AQ20)/SUM(Input!AN20:AO20))","v":""},{"$f":"IF(Input!K20=\"\",\"\",Input!K20)","v":""},{"$f":"IF(Input!A20=\"\",\"\",Input!A20)","v":""},{"$f":"IF(Input!AT20=\"\",\"\",Input!AT20)","v":""},{"$f":"IF(Input!BC20=\"\",\"\",Input!BC20)","v":""},{"$f":"IF(Input!BD20=\"\",\"\",Input!BD20)","v":""},{"$f":"IF(Input!BG20=\"\",\"\",Input!BG20)","v":""},{"$f":"IF(Input!AX20=\"\",\"\",Input!AX20)","v":""},{"$f":"IF(Input!V20=\"\",\"\",Input!V20)","v":""}]
["",{"$f":"IF( Input!B21=\"\",\"\",Input!B21)","v":""},{"$f":"IF( Input!C21=\"\",\"\",Input!C21)","v":""},{"$f":"IF( Input!E21=\"\",\"\",Input!E21)","v":""},{"$f":"IF( Input!F21=\"\",\"\",Input!F21)","v":""},{"$f":"IF( Input!G21=\"\",\"\",Input!G21)","v":""},{"$f":"IF( Input!F21=\"\",\"\",Input!F21*Input!Y21+Input!Z21)","v":""},{"$f":"IF( Input!H21=\"\",\"\",Input!H21)","v":""},{"$f":"IF( Input!I21=\"\",\"\",Input!I21)","v":""},{"$f":"IF( Input!AH21=\"\",\"\",Input!AH21)","v":""},{"$f":"IF( Input!AF21=\"\",\"\",Input!AF21)","v":""},{"$f":"IF( Input!L21=\"\",\"\",Input!L21)","v":""},{"$f":"IF( Input!N21=\"\",\"\",Input!N21)","v":""},{"$f":"IF( Input!O21=\"\",\"\",Input!O21)","v":""},{"$f":"IF( Input!P21=\"\",\"\",Input!P21)","v":""},{"$f":"IF( Input!O21=\"\",\"\",Input!O21*Input!AL21+Input!AM21)","v":""},{"$f":"IF( Input!Q21=\"\",\"\",Input!Q21)","v":""},{"$f":"IF( Input!R21=\"\",\"\",Input!R21)","v":""},{"$f":"IF( Input!AU21=\"\",\"\",Input!AU21)","v":""},{"$f":"IF( Input!AS21=\"\",\"\",Input!AS21)","v":""},{"$f":"IF( Input!BB21=\"\",\"\",Input!BB21)","v":""},{"$f":"IF(Input!AY21=\"\",\"\",Input!AY21)","v":""},{"$f":"IF(Input!AZ21=\"\",\"\",Input!AZ21)","v":""},null,{"$f":"IF(Input!AR21=\"\",\"\",Input!AR21)","v":""},{"$f":"IF(Input!B21=\"\",\"\",(Input!AN21*Input!AP21+Input!AO21*Input!AQ21)/SUM(Input!AN21:AO21))","v":""},{"$f":"IF(Input!K21=\"\",\"\",Input!K21)","v":""},{"$f":"IF(Input!A21=\"\",\"\",Input!A21)","v":""},{"$f":"IF(Input!AT21=\"\",\"\",Input!AT21)","v":""},{"$f":"IF(Input!BC21=\"\",\"\",Input!BC21)","v":""},{"$f":"IF(Input!BD21=\"\",\"\",Input!BD21)","v":""},{"$f":"IF(Input!BG21=\"\",\"\",Input!BG21)","v":""},{"$f":"IF(Input!AX21=\"\",\"\",Input!AX21)","v":""},{"$f":"IF(Input!V21=\"\",\"\",Input!V21)","v":""}]
["",{"$f":"IF( Input!B22=\"\",\"\",Input!B22)","v":""},{"$f":"IF( Input!C22=\"\",\"\",Input!C22)","v":""},{"$f":"IF( Input!E22=\"\",\"\",Input!E22)","v":""},{"$f":"IF( Input!F22=\"\",\"\",Input!F22)","v":""},{"$f":"IF( Input!G22=\"\",\"\",Input!G22)","v":""},{"$f":"IF( Input!F22=\"\",\"\",Input!F22*Input!Y22+Input!Z22)","v":""},{"$f":"IF( Input!H22=\"\",\"\",Input!H22)","v":""},{"$f":"IF( Input!I22=\"\",\"\",Input!I22)","v":""},{"$f":"IF( Input!AH22=\"\",\"\",Input!AH22)","v":""},{"$f":"IF( Input!AF22=\"\",\"\",Input!AF22)","v":""},{"$f":"IF( Input!L22=\"\",\"\",Input!L22)","v":""},{"$f":"IF( Input!N22=\"\",\"\",Input!N22)","v":""},{"$f":"IF( Input!O22=\"\",\"\",Input!O22)","v":""},{"$f":"IF( Input!P22=\"\",\"\",Input!P22)","v":""},{"$f":"IF( Input!O22=\"\",\"\",Input!O22*Input!AL22+Input!AM22)","v":""},{"$f":"IF( Input!Q22=\"\",\"\",Input!Q22)","v":""},{"$f":"IF( Input!R22=\"\",\"\",Input!R22)","v":""},{"$f":"IF( Input!AU22=\"\",\"\",Input!AU22)","v":""},{"$f":"IF( Input!AS22=\"\",\"\",Input!AS22)","v":""},{"$f":"IF( Input!BB22=\"\",\"\",Input!BB22)","v":""},{"$f":"IF(Input!AY22=\"\",\"\",Input!AY22)","v":""},{"$f":"IF(Input!AZ22=\"\",\"\",Input!AZ22)","v":""},null,{"$f":"IF(Input!AR22=\"\",\"\",Input!AR22)","v":""},{"$f":"IF(Input!B22=\"\",\"\",(Input!AN22*Input!AP22+Input!AO22*Input!AQ22)/SUM(Input!AN22:AO22))","v":""},{"$f":"IF(Input!K22=\"\",\"\",Input!K22)","v":""},{"$f":"IF(Input!A22=\"\",\"\",Input!A22)","v":""},{"$f":"IF(Input!AT22=\"\",\"\",Input!AT22)","v":""},{"$f":"IF(Input!BC22=\"\",\"\",Input!BC22)","v":""},{"$f":"IF(Input!BD22=\"\",\"\",Input!BD22)","v":""},{"$f":"IF(Input!BG22=\"\",\"\",Input!BG22)","v":""},{"$f":"IF(Input!AX22=\"\",\"\",Input!AX22)","v":""},{"$f":"IF(Input!V22=\"\",\"\",Input!V22)","v":""}]
["",{"$f":"IF( Input!B23=\"\",\"\",Input!B23)","v":""},{"$f":"IF( Input!C23=\"\",\"\",Input!C23)","v":""},{"$f":"IF( Input!E23=\"\",\"\",Input!E23)","v":""},{"$f":"IF( Input!F23=\"\",\"\",Input!F23)","v":""},{"$f":"IF( Input!G23=\"\",\"\",Input!G23)","v":""},{"$f":"IF( Input!F23=\"\",\"\",Input!F23*Input!Y23+Input!Z23)","v":""},{"$f":"IF( Input!H23=\"\",\"\",Input!H23)","v":""},{"$f":"IF( Input!I23=\"\",\"\",Input!I23)","v":""},{"$f":"IF( Input!AH23=\"\",\"\",Input!AH23)","v":""},{"$f":"IF( Input!AF23=\"\",\"\",Input!AF23)","v":""},{"$f":"IF( Input!L23=\"\",\"\",Input!L23)","v":""},{"$f":"IF( Input!N23=\"\",\"\",Input!N23)","v":""},{"$f":"IF( Input!O23=\"\",\"\",Input!O23)","v":""},{"$f":"IF( Input!P23=\"\",\"\",Input!P23)","v":""},{"$f":"IF( Input!O23=\"\",\"\",Input!O23*Input!AL23+Input!AM23)","v":""},{"$f":"IF( Input!Q23=\"\",\"\",Input!Q23)","v":""},{"$f":"IF( Input!R23=\"\",\"\",Input!R23)","v":""},{"$f":"IF( Input!AU23=\"\",\"\",Input!AU23)","v":""},{"$f":"IF( Input!AS23=\"\",\"\",Input!AS23)","v":""},{"$f":"IF( Input!BB23=\"\",\"\",Input!BB23)","v":""},{"$f":"IF(Input!AY23=\"\",\"\",Input!AY23)","v":""},{"$f":"IF(Input!AZ23=\"\",\"\",Input!AZ23)","v":""},null,{"$f":"IF(Input!AR23=\"\",\"\",Input!AR23)","v":""},{"$f":"IF(Input!B23=\"\",\"\",(Input!AN23*Input!AP23+Input!AO23*Input!AQ23)/SUM(Input!AN23:AO23))","v":""},{"$f":"IF(Input!K23=\"\",\"\",Input!K23)","v":""},{"$f":"IF(Input!A23=\"\",\"\",Input!A23)","v":""},{"$f":"IF(Input!AT23=\"\",\"\",Input!AT23)","v":""},{"$f":"IF(Input!BC23=\"\",\"\",Input!BC23)","v":""},{"$f":"IF(Input!BD23=\"\",\"\",Input!BD23)","v":""},{"$f":"IF(Input!BG23=\"\",\"\",Input!BG23)","v":""},{"$f":"IF(Input!AX23=\"\",\"\",Input!AX23)","v":""},{"$f":"IF(Input!V23=\"\",\"\",Input!V23)","v":""}]
["",{"$f":"IF( Input!B24=\"\",\"\",Input!B24)","v":""},{"$f":"IF( Input!C24=\"\",\"\",Input!C24)","v":""},{"$f":"IF( Input!E24=\"\",\"\",Input!E24)","v":""},{"$f":"IF( Input!F24=\"\",\"\",Input!F24)","v":""},{"$f":"IF( Input!G24=\"\",\"\",Input!G24)","v":""},{"$f":"IF( Input!F24=\"\",\"\",Input!F24*Input!Y24+Input!Z24)","v":""},{"$f":"IF( Input!H24=\"\",\"\",Input!H24)","v":""},{"$f":"IF( Input!I24=\"\",\"\",Input!I24)","v":""},{"$f":"IF( Input!AH24=\"\",\"\",Input!AH24)","v":""},{"$f":"IF( Input!AF24=\"\",\"\",Input!AF24)","v":""},{"$f":"IF( Input!L24=\"\",\"\",Input!L24)","v":""},{"$f":"IF( Input!N24=\"\",\"\",Input!N24)","v":""},{"$f":"IF( Input!O24=\"\",\"\",Input!O24)","v":""},{"$f":"IF( Input!P24=\"\",\"\",Input!P24)","v":""},{"$f":"IF( Input!O24=\"\",\"\",Input!O24*Input!AL24+Input!AM24)","v":""},{"$f":"IF( Input!Q24=\"\",\"\",Input!Q24)","v":""},{"$f":"IF( Input!R24=\"\",\"\",Input!R24)","v":""},{"$f":"IF( Input!AU24=\"\",\"\",Input!AU24)","v":""},{"$f":"IF( Input!AS24=\"\",\"\",Input!AS24)","v":""},{"$f":"IF( Input!BB24=\"\",\"\",Input!BB24)","v":""},{"$f":"IF(Input!AY24=\"\",\"\",Input!AY24)","v":""},{"$f":"IF(Input!AZ24=\"\",\"\",Input!AZ24)","v":""},null,{"$f":"IF(Input!AR24=\"\",\"\",Input!AR24)","v":""},{"$f":"IF(Input!B24=\"\",\"\",(Input!AN24*Input!AP24+Input!AO24*Input!AQ24)/SUM(Input!AN24:AO24))","v":""},{"$f":"IF(Input!K24=\"\",\"\",Input!K24)","v":""},{"$f":"IF(Input!A24=\"\",\"\",Input!A24)","v":""},{"$f":"IF(Input!AT24=\"\",\"\",Input!AT24)","v":""},{"$f":"IF(Input!BC24=\"\",\"\",Input!BC24)","v":""},{"$f":"IF(Input!BD24=\"\",\"\",Input!BD24)","v":""},{"$f":"IF(Input!BG24=\"\",\"\",Input!BG24)","v":""},{"$f":"IF(Input!AX24=\"\",\"\",Input!AX24)","v":""},{"$f":"IF(Input!V24=\"\",\"\",Input!V24)","v":""}]
["",{"$f":"IF( Input!B25=\"\",\"\",Input!B25)","v":""},{"$f":"IF( Input!C25=\"\",\"\",Input!C25)","v":""},{"$f":"IF( Input!E25=\"\",\"\",Input!E25)","v":""},{"$f":"IF( Input!F25=\"\",\"\",Input!F25)","v":""},{"$f":"IF( Input!G25=\"\",\"\",Input!G25)","v":""},{"$f":"IF( Input!F25=\"\",\"\",Input!F25*Input!Y25+Input!Z25)","v":""},{"$f":"IF( Input!H25=\"\",\"\",Input!H25)","v":""},{"$f":"IF( Input!I25=\"\",\"\",Input!I25)","v":""},{"$f":"IF( Input!AH25=\"\",\"\",Input!AH25)","v":""},{"$f":"IF( Input!AF25=\"\",\"\",Input!AF25)","v":""},{"$f":"IF( Input!L25=\"\",\"\",Input!L25)","v":""},{"$f":"IF( Input!N25=\"\",\"\",Input!N25)","v":""},{"$f":"IF( Input!O25=\"\",\"\",Input!O25)","v":""},{"$f":"IF( Input!P25=\"\",\"\",Input!P25)","v":""},{"$f":"IF( Input!O25=\"\",\"\",Input!O25*Input!AL25+Input!AM25)","v":""},{"$f":"IF( Input!Q25=\"\",\"\",Input!Q25)","v":""},{"$f":"IF( Input!R25=\"\",\"\",Input!R25)","v":""},{"$f":"IF( Input!AU25=\"\",\"\",Input!AU25)","v":""},{"$f":"IF( Input!AS25=\"\",\"\",Input!AS25)","v":""},{"$f":"IF( Input!BB25=\"\",\"\",Input!BB25)","v":""},{"$f":"IF(Input!AY25=\"\",\"\",Input!AY25)","v":""},{"$f":"IF(Input!AZ25=\"\",\"\",Input!AZ25)","v":""},null,{"$f":"IF(Input!AR25=\"\",\"\",Input!AR25)","v":""},{"$f":"IF(Input!B25=\"\",\"\",(Input!AN25*Input!AP25+Input!AO25*Input!AQ25)/SUM(Input!AN25:AO25))","v":""},{"$f":"IF(Input!K25=\"\",\"\",Input!K25)","v":""},{"$f":"IF(Input!A25=\"\",\"\",Input!A25)","v":""},{"$f":"IF(Input!AT25=\"\",\"\",Input!AT25)","v":""},{"$f":"IF(Input!BC25=\"\",\"\",Input!BC25)","v":""},{"$f":"IF(Input!BD25=\"\",\"\",Input!BD25)","v":""},{"$f":"IF(Input!BG25=\"\",\"\",Input!BG25)","v":""},{"$f":"IF(Input!AX25=\"\",\"\",Input!AX25)","v":""},{"$f":"IF(Input!V25=\"\",\"\",Input!V25)","v":""}]
["",{"$f":"IF( Input!B26=\"\",\"\",Input!B26)","v":""},{"$f":"IF( Input!C26=\"\",\"\",Input!C26)","v":""},{"$f":"IF( Input!E26=\"\",\"\",Input!E26)","v":""},{"$f":"IF( Input!F26=\"\",\"\",Input!F26)","v":""},{"$f":"IF( Input!G26=\"\",\"\",Input!G26)","v":""},{"$f":"IF( Input!F26=\"\",\"\",Input!F26*Input!Y26+Input!Z26)","v":""},{"$f":"IF( Input!H26=\"\",\"\",Input!H26)","v":""},{"$f":"IF( Input!I26=\"\",\"\",Input!I26)","v":""},{"$f":"IF( Input!AH26=\"\",\"\",Input!AH26)","v":""},{"$f":"IF( Input!AF26=\"\",\"\",Input!AF26)","v":""},{"$f":"IF( Input!L26=\"\",\"\",Input!L26)","v":""},{"$f":"IF( Input!N26=\"\",\"\",Input!N26)","v":""},{"$f":"IF( Input!O26=\"\",\"\",Input!O26)","v":""},{"$f":"IF( Input!P26=\"\",\"\",Input!P26)","v":""},{"$f":"IF( Input!O26=\"\",\"\",Input!O26*Input!AL26+Input!AM26)","v":""},{"$f":"IF( Input!Q26=\"\",\"\",Input!Q26)","v":""},{"$f":"IF( Input!R26=\"\",\"\",Input!R26)","v":""},{"$f":"IF( Input!AU26=\"\",\"\",Input!AU26)","v":""},{"$f":"IF( Input!AS26=\"\",\"\",Input!AS26)","v":""},{"$f":"IF( Input!BB26=\"\",\"\",Input!BB26)","v":""},{"$f":"IF(Input!AY26=\"\",\"\",Input!AY26)","v":""},{"$f":"IF(Input!AZ26=\"\",\"\",Input!AZ26)","v":""},null,{"$f":"IF(Input!AR26=\"\",\"\",Input!AR26)","v":""},{"$f":"IF(Input!B26=\"\",\"\",(Input!AN26*Input!AP26+Input!AO26*Input!AQ26)/SUM(Input!AN26:AO26))","v":""},{"$f":"IF(Input!K26=\"\",\"\",Input!K26)","v":""},{"$f":"IF(Input!A26=\"\",\"\",Input!A26)","v":""},{"$f":"IF(Input!AT26=\"\",\"\",Input!AT26)","v":""},{"$f":"IF(Input!BC26=\"\",\"\",Input!BC26)","v":""},{"$f":"IF(Input!BD26=\"\",\"\",Input!BD26)","v":""},{"$f":"IF(Input!BG26=\"\",\"\",Input!BG26)","v":""},{"$f":"IF(Input!AX26=\"\",\"\",Input!AX26)","v":""},{"$f":"IF(Input!V26=\"\",\"\",Input!V26)","v":""}]
["",{"$f":"IF( Input!B27=\"\",\"\",Input!B27)","v":""},{"$f":"IF( Input!C27=\"\",\"\",Input!C27)","v":""},{"$f":"IF( Input!E27=\"\",\"\",Input!E27)","v":""},{"$f":"IF( Input!F27=\"\",\"\",Input!F27)","v":""},{"$f":"IF( Input!G27=\"\",\"\",Input!G27)","v":""},{"$f":"IF( Input!F27=\"\",\"\",Input!F27*Input!Y27+Input!Z27)","v":""},{"$f":"IF( Input!H27=\"\",\"\",Input!H27)","v":""},{"$f":"IF( Input!I27=\"\",\"\",Input!I27)","v":""},{"$f":"IF( Input!AH27=\"\",\"\",Input!AH27)","v":""},{"$f":"IF( Input!AF27=\"\",\"\",Input!AF27)","v":""},{"$f":"IF( Input!L27=\"\",\"\",Input!L27)","v":""},{"$f":"IF( Input!N27=\"\",\"\",Input!N27)","v":""},{"$f":"IF( Input!O27=\"\",\"\",Input!O27)","v":""},{"$f":"IF( Input!P27=\"\",\"\",Input!P27)","v":""},{"$f":"IF( Input!O27=\"\",\"\",Input!O27*Input!AL27+Input!AM27)","v":""},{"$f":"IF( Input!Q27=\"\",\"\",Input!Q27)","v":""},{"$f":"IF( Input!R27=\"\",\"\",Input!R27)","v":""},{"$f":"IF( Input!AU27=\"\",\"\",Input!AU27)","v":""},{"$f":"IF( Input!AS27=\"\",\"\",Input!AS27)","v":""},{"$f":"IF( Input!BB27=\"\",\"\",Input!BB27)","v":""},{"$f":"IF(Input!AY27=\"\",\"\",Input!AY27)","v":""},{"$f":"IF(Input!AZ27=\"\",\"\",Input!AZ27)","v":""},null,{"$f":"IF(Input!AR27=\"\",\"\",Input!AR27)","v":""},{"$f":"IF(Input!B27=\"\",\"\",(Input!AN27*Input!AP27+Input!AO27*Input!AQ27)/SUM(Input!AN27:AO27))","v":""},{"$f":"IF(Input!K27=\"\",\"\",Input!K27)","v":""},{"$f":"IF(Input!A27=\"\",\"\",Input!A27)","v":""},{"$f":"IF(Input!AT27=\"\",\"\",Input!AT27)","v":""},{"$f":"IF(Input!BC27=\"\",\"\",Input!BC27)","v":""},{"$f":"IF(Input!BD27=\"\",\"\",Input!BD27)","v":""},{"$f":"IF(Input!BG27=\"\",\"\",Input!BG27)","v":""},{"$f":"IF(Input!AX27=\"\",\"\",Input!AX27)","v":""},{"$f":"IF(Input!V27=\"\",\"\",Input!V27)","v":""}]
["",{"$f":"IF( Input!B28=\"\",\"\",Input!B28)","v":""},{"$f":"IF( Input!C28=\"\",\"\",Input!C28)","v":""},{"$f":"IF( Input!E28=\"\",\"\",Input!E28)","v":""},{"$f":"IF( Input!F28=\"\",\"\",Input!F28)","v":""},{"$f":"IF( Input!G28=\"\",\"\",Input!G28)","v":""},{"$f":"IF( Input!F28=\"\",\"\",Input!F28*Input!Y28+Input!Z28)","v":""},{"$f":"IF( Input!H28=\"\",\"\",Input!H28)","v":""},{"$f":"IF( Input!I28=\"\",\"\",Input!I28)","v":""},{"$f":"IF( Input!AH28=\"\",\"\",Input!AH28)","v":""},{"$f":"IF( Input!AF28=\"\",\"\",Input!AF28)","v":""},{"$f":"IF( Input!L28=\"\",\"\",Input!L28)","v":""},{"$f":"IF( Input!N28=\"\",\"\",Input!N28)","v":""},{"$f":"IF( Input!O28=\"\",\"\",Input!O28)","v":""},{"$f":"IF( Input!P28=\"\",\"\",Input!P28)","v":""},{"$f":"IF( Input!O28=\"\",\"\",Input!O28*Input!AL28+Input!AM28)","v":""},{"$f":"IF( Input!Q28=\"\",\"\",Input!Q28)","v":""},{"$f":"IF( Input!R28=\"\",\"\",Input!R28)","v":""},{"$f":"IF( Input!AU28=\"\",\"\",Input!AU28)","v":""},{"$f":"IF( Input!AS28=\"\",\"\",Input!AS28)","v":""},{"$f":"IF( Input!BB28=\"\",\"\",Input!BB28)","v":""},{"$f":"IF(Input!AY28=\"\",\"\",Input!AY28)","v":""},{"$f":"IF(Input!AZ28=\"\",\"\",Input!AZ28)","v":""},null,{"$f":"IF(Input!AR28=\"\",\"\",Input!AR28)","v":""},{"$f":"IF(Input!B28=\"\",\"\",(Input!AN28*Input!AP28+Input!AO28*Input!AQ28)/SUM(Input!AN28:AO28))","v":""},{"$f":"IF(Input!K28=\"\",\"\",Input!K28)","v":""},{"$f":"IF(Input!A28=\"\",\"\",Input!A28)","v":""},{"$f":"IF(Input!AT28=\"\",\"\",Input!AT28)","v":""},{"$f":"IF(Input!BC28=\"\",\"\",Input!BC28)","v":""},{"$f":"IF(Input!BD28=\"\",\"\",Input!BD28)","v":""},{"$f":"IF(Input!BG28=\"\",\"\",Input!BG28)","v":""},{"$f":"IF(Input!AX28=\"\",\"\",Input!AX28)","v":""},{"$f":"IF(Input!V28=\"\",\"\",Input!V28)","v":""}]
["",{"$f":"IF( Input!B29=\"\",\"\",Input!B29)","v":""},{"$f":"IF( Input!C29=\"\",\"\",Input!C29)","v":""},{"$f":"IF( Input!E29=\"\",\"\",Input!E29)","v":""},{"$f":"IF( Input!F29=\"\",\"\",Input!F29)","v":""},{"$f":"IF( Input!G29=\"\",\"\",Input!G29)","v":""},{"$f":"IF( Input!F29=\"\",\"\",Input!F29*Input!Y29+Input!Z29)","v":""},{"$f":"IF( Input!H29=\"\",\"\",Input!H29)","v":""},{"$f":"IF( Input!I29=\"\",\"\",Input!I29)","v":""},{"$f":"IF( Input!AH29=\"\",\"\",Input!AH29)","v":""},{"$f":"IF( Input!AF29=\"\",\"\",Input!AF29)","v":""},{"$f":"IF( Input!L29=\"\",\"\",Input!L29)","v":""},{"$f":"IF( Input!N29=\"\",\"\",Input!N29)","v":""},{"$f":"IF( Input!O29=\"\",\"\",Input!O29)","v":""},{"$f":"IF( Input!P29=\"\",\"\",Input!P29)","v":""},{"$f":"IF( Input!O29=\"\",\"\",Input!O29*Input!AL29+Input!AM29)","v":""},{"$f":"IF( Input!Q29=\"\",\"\",Input!Q29)","v":""},{"$f":"IF( Input!R29=\"\",\"\",Input!R29)","v":""},{"$f":"IF( Input!AU29=\"\",\"\",Input!AU29)","v":""},{"$f":"IF( Input!AS29=\"\",\"\",Input!AS29)","v":""},{"$f":"IF( Input!BB29=\"\",\"\",Input!BB29)","v":""},{"$f":"IF(Input!AY29=\"\",\"\",Input!AY29)","v":""},{"$f":"IF(Input!AZ29=\"\",\"\",Input!AZ29)","v":""},null,{"$f":"IF(Input!AR29=\"\",\"\",Input!AR29)","v":""},{"$f":"IF(Input!B29=\"\",\"\",(Input!AN29*Input!AP29+Input!AO29*Input!AQ29)/SUM(Input!AN29:AO29))","v":""},{"$f":"IF(Input!K29=\"\",\"\",Input!K29)","v":""},{"$f":"IF(Input!A29=\"\",\"\",Input!A29)","v":""},{"$f":"IF(Input!AT29=\"\",\"\",Input!AT29)","v":""},{"$f":"IF(Input!BC29=\"\",\"\",Input!BC29)","v":""},{"$f":"IF(Input!BD29=\"\",\"\",Input!BD29)","v":""},{"$f":"IF(Input!BG29=\"\",\"\",Input!BG29)","v":""},{"$f":"IF(Input!AX29=\"\",\"\",Input!AX29)","v":""},{"$f":"IF(Input!V29=\"\",\"\",Input!V29)","v":""}]
["",{"$f":"IF( Input!B30=\"\",\"\",Input!B30)","v":""},{"$f":"IF( Input!C30=\"\",\"\",Input!C30)","v":""},{"$f":"IF( Input!E30=\"\",\"\",Input!E30)","v":""},{"$f":"IF( Input!F30=\"\",\"\",Input!F30)","v":""},{"$f":"IF( Input!G30=\"\",\"\",Input!G30)","v":""},{"$f":"IF( Input!F30=\"\",\"\",Input!F30*Input!Y30+Input!Z30)","v":""},{"$f":"IF( Input!H30=\"\",\"\",Input!H30)","v":""},{"$f":"IF( Input!I30=\"\",\"\",Input!I30)","v":""},{"$f":"IF( Input!AH30=\"\",\"\",Input!AH30)","v":""},{"$f":"IF( Input!AF30=\"\",\"\",Input!AF30)","v":""},{"$f":"IF( Input!L30=\"\",\"\",Input!L30)","v":""},{"$f":"IF( Input!N30=\"\",\"\",Input!N30)","v":""},{"$f":"IF( Input!O30=\"\",\"\",Input!O30)","v":""},{"$f":"IF( Input!P30=\"\",\"\",Input!P30)","v":""},{"$f":"IF( Input!O30=\"\",\"\",Input!O30*Input!AL30+Input!AM30)","v":""},{"$f":"IF( Input!Q30=\"\",\"\",Input!Q30)","v":""},{"$f":"IF( Input!R30=\"\",\"\",Input!R30)","v":""},{"$f":"IF( Input!AU30=\"\",\"\",Input!AU30)","v":""},{"$f":"IF( Input!AS30=\"\",\"\",Input!AS30)","v":""},{"$f":"IF( Input!BB30=\"\",\"\",Input!BB30)","v":""},{"$f":"IF(Input!AY30=\"\",\"\",Input!AY30)","v":""},{"$f":"IF(Input!AZ30=\"\",\"\",Input!AZ30)","v":""},null,{"$f":"IF(Input!AR30=\"\",\"\",Input!AR30)","v":""},{"$f":"IF(Input!B30=\"\",\"\",(Input!AN30*Input!AP30+Input!AO30*Input!AQ30)/SUM(Input!AN30:AO30))","v":""},{"$f":"IF(Input!K30=\"\",\"\",Input!K30)","v":""},{"$f":"IF(Input!A30=\"\",\"\",Input!A30)","v":""},{"$f":"IF(Input!AT30=\"\",\"\",Input!AT30)","v":""},{"$f":"IF(Input!BC30=\"\",\"\",Input!BC30)","v":""},{"$f":"IF(Input!BD30=\"\",\"\",Input!BD30)","v":""},{"$f":"IF(Input!BG30=\"\",\"\",Input!BG30)","v":""},{"$f":"IF(Input!AX30=\"\",\"\",Input!AX30)","v":""},{"$f":"IF(Input!V30=\"\",\"\",Input!V30)","v":""}]
["",{"$f":"IF( Input!B31=\"\",\"\",Input!B31)","v":""},{"$f":"IF( Input!C31=\"\",\"\",Input!C31)","v":""},{"$f":"IF( Input!E31=\"\",\"\",Input!E31)","v":""},{"$f":"IF( Input!F31=\"\",\"\",Input!F31)","v":""},{"$f":"IF( Input!G31=\"\",\"\",Input!G31)","v":""},{"$f":"IF( Input!F31=\"\",\"\",Input!F31*Input!Y31+Input!Z31)","v":""},{"$f":"IF( Input!H31=\"\",\"\",Input!H31)","v":""},{"$f":"IF( Input!I31=\"\",\"\",Input!I31)","v":""},{"$f":"IF( Input!AH31=\"\",\"\",Input!AH31)","v":""},{"$f":"IF( Input!AF31=\"\",\"\",Input!AF31)","v":""},{"$f":"IF( Input!L31=\"\",\"\",Input!L31)","v":""},{"$f":"IF( Input!N31=\"\",\"\",Input!N31)","v":""},{"$f":"IF( Input!O31=\"\",\"\",Input!O31)","v":""},{"$f":"IF( Input!P31=\"\",\"\",Input!P31)","v":""},{"$f":"IF( Input!O31=\"\",\"\",Input!O31*Input!AL31+Input!AM31)","v":""},{"$f":"IF( Input!Q31=\"\",\"\",Input!Q31)","v":""},{"$f":"IF( Input!R31=\"\",\"\",Input!R31)","v":""},{"$f":"IF( Input!AU31=\"\",\"\",Input!AU31)","v":""},{"$f":"IF( Input!AS31=\"\",\"\",Input!AS31)","v":""},{"$f":"IF( Input!BB31=\"\",\"\",Input!BB31)","v":""},{"$f":"IF(Input!AY31=\"\",\"\",Input!AY31)","v":""},{"$f":"IF(Input!AZ31=\"\",\"\",Input!AZ31)","v":""},null,{"$f":"IF(Input!AR31=\"\",\"\",Input!AR31)","v":""},{"$f":"IF(Input!B31=\"\",\"\",(Input!AN31*Input!AP31+Input!AO31*Input!AQ31)/SUM(Input!AN31:AO31))","v":""},{"$f":"IF(Input!K31=\"\",\"\",Input!K31)","v":""},{"$f":"IF(Input!A31=\"\",\"\",Input!A31)","v":""},{"$f":"IF(Input!AT31=\"\",\"\",Input!AT31)","v":""},{"$f":"IF(Input!BC31=\"\",\"\",Input!BC31)","v":""},{"$f":"IF(Input!BD31=\"\",\"\",Input!BD31)","v":""},{"$f":"IF(Input!BG31=\"\",\"\",Input!BG31)","v":""},{"$f":"IF(Input!AX31=\"\",\"\",Input!AX31)","v":""},{"$f":"IF(Input!V31=\"\",\"\",Input!V31)","v":""}]
["",{"$f":"IF( Input!B32=\"\",\"\",Input!B32)","v":""},{"$f":"IF( Input!C32=\"\",\"\",Input!C32)","v":""},{"$f":"IF( Input!E32=\"\",\"\",Input!E32)","v":""},{"$f":"IF( Input!F32=\"\",\"\",Input!F32)","v":""},{"$f":"IF( Input!G32=\"\",\"\",Input!G32)","v":""},{"$f":"IF( Input!F32=\"\",\"\",Input!F32*Input!Y32+Input!Z32)","v":""},{"$f":"IF( Input!H32=\"\",\"\",Input!H32)","v":""},{"$f":"IF( Input!I32=\"\",\"\",Input!I32)","v":""},{"$f":"IF( Input!AH32=\"\",\"\",Input!AH32)","v":""},{"$f":"IF( Input!AF32=\"\",\"\",Input!AF32)","v":""},{"$f":"IF( Input!L32=\"\",\"\",Input!L32)","v":""},{"$f":"IF( Input!N32=\"\",\"\",Input!N32)","v":""},{"$f":"IF( Input!O32=\"\",\"\",Input!O32)","v":""},{"$f":"IF( Input!P32=\"\",\"\",Input!P32)","v":""},{"$f":"IF( Input!O32=\"\",\"\",Input!O32*Input!AL32+Input!AM32)","v":""},{"$f":"IF( Input!Q32=\"\",\"\",Input!Q32)","v":""},{"$f":"IF( Input!R32=\"\",\"\",Input!R32)","v":""},{"$f":"IF( Input!AU32=\"\",\"\",Input!AU32)","v":""},{"$f":"IF( Input!AS32=\"\",\"\",Input!AS32)","v":""},{"$f":"IF( Input!BB32=\"\",\"\",Input!BB32)","v":""},{"$f":"IF(Input!AY32=\"\",\"\",Input!AY32)","v":""},{"$f":"IF(Input!AZ32=\"\",\"\",Input!AZ32)","v":""},null,{"$f":"IF(Input!AR32=\"\",\"\",Input!AR32)","v":""},{"$f":"IF(Input!B32=\"\",\"\",(Input!AN32*Input!AP32+Input!AO32*Input!AQ32)/SUM(Input!AN32:AO32))","v":""},{"$f":"IF(Input!K32=\"\",\"\",Input!K32)","v":""},{"$f":"IF(Input!A32=\"\",\"\",Input!A32)","v":""},{"$f":"IF(Input!AT32=\"\",\"\",Input!AT32)","v":""},{"$f":"IF(Input!BC32=\"\",\"\",Input!BC32)","v":""},{"$f":"IF(Input!BD32=\"\",\"\",Input!BD32)","v":""},{"$f":"IF(Input!BG32=\"\",\"\",Input!BG32)","v":""},{"$f":"IF(Input!AX32=\"\",\"\",Input!AX32)","v":""},{"$f":"IF(Input!V32=\"\",\"\",Input!V32)","v":""}]
["",{"$f":"IF( Input!B33=\"\",\"\",Input!B33)","v":""},{"$f":"IF( Input!C33=\"\",\"\",Input!C33)","v":""},{"$f":"IF( Input!E33=\"\",\"\",Input!E33)","v":""},{"$f":"IF( Input!F33=\"\",\"\",Input!F33)","v":""},{"$f":"IF( Input!G33=\"\",\"\",Input!G33)","v":""},{"$f":"IF( Input!F33=\"\",\"\",Input!F33*Input!Y33+Input!Z33)","v":""},{"$f":"IF( Input!H33=\"\",\"\",Input!H33)","v":""},{"$f":"IF( Input!I33=\"\",\"\",Input!I33)","v":""},{"$f":"IF( Input!AH33=\"\",\"\",Input!AH33)","v":""},{"$f":"IF( Input!AF33=\"\",\"\",Input!AF33)","v":""},{"$f":"IF( Input!L33=\"\",\"\",Input!L33)","v":""},{"$f":"IF( Input!N33=\"\",\"\",Input!N33)","v":""},{"$f":"IF( Input!O33=\"\",\"\",Input!O33)","v":""},{"$f":"IF( Input!P33=\"\",\"\",Input!P33)","v":""},{"$f":"IF( Input!O33=\"\",\"\",Input!O33*Input!AL33+Input!AM33)","v":""},{"$f":"IF( Input!Q33=\"\",\"\",Input!Q33)","v":""},{"$f":"IF( Input!R33=\"\",\"\",Input!R33)","v":""},{"$f":"IF( Input!AU33=\"\",\"\",Input!AU33)","v":""},{"$f":"IF( Input!AS33=\"\",\"\",Input!AS33)","v":""},{"$f":"IF( Input!BB33=\"\",\"\",Input!BB33)","v":""},{"$f":"IF(Input!AY33=\"\",\"\",Input!AY33)","v":""},{"$f":"IF(Input!AZ33=\"\",\"\",Input!AZ33)","v":""},null,{"$f":"IF(Input!AR33=\"\",\"\",Input!AR33)","v":""},{"$f":"IF(Input!B33=\"\",\"\",(Input!AN33*Input!AP33+Input!AO33*Input!AQ33)/SUM(Input!AN33:AO33))","v":""},{"$f":"IF(Input!K33=\"\",\"\",Input!K33)","v":""},{"$f":"IF(Input!A33=\"\",\"\",Input!A33)","v":""},{"$f":"IF(Input!AT33=\"\",\"\",Input!AT33)","v":""},{"$f":"IF(Input!BC33=\"\",\"\",Input!BC33)","v":""},{"$f":"IF(Input!BD33=\"\",\"\",Input!BD33)","v":""},{"$f":"IF(Input!BG33=\"\",\"\",Input!BG33)","v":""},{"$f":"IF(Input!AX33=\"\",\"\",Input!AX33)","v":""},{"$f":"IF(Input!V33=\"\",\"\",Input!V33)","v":""}]
["",{"$f":"IF( Input!B34=\"\",\"\",Input!B34)","v":""},{"$f":"IF( Input!C34=\"\",\"\",Input!C34)","v":""},{"$f":"IF( Input!E34=\"\",\"\",Input!E34)","v":""},{"$f":"IF( Input!F34=\"\",\"\",Input!F34)","v":""},{"$f":"IF( Input!G34=\"\",\"\",Input!G34)","v":""},{"$f":"IF( Input!F34=\"\",\"\",Input!F34*Input!Y34+Input!Z34)","v":""},{"$f":"IF( Input!H34=\"\",\"\",Input!H34)","v":""},{"$f":"IF( Input!I34=\"\",\"\",Input!I34)","v":""},{"$f":"IF( Input!AH34=\"\",\"\",Input!AH34)","v":""},{"$f":"IF( Input!AF34=\"\",\"\",Input!AF34)","v":""},{"$f":"IF( Input!L34=\"\",\"\",Input!L34)","v":""},{"$f":"IF( Input!N34=\"\",\"\",Input!N34)","v":""},{"$f":"IF( Input!O34=\"\",\"\",Input!O34)","v":""},{"$f":"IF( Input!P34=\"\",\"\",Input!P34)","v":""},{"$f":"IF( Input!O34=\"\",\"\",Input!O34*Input!AL34+Input!AM34)","v":""},{"$f":"IF( Input!Q34=\"\",\"\",Input!Q34)","v":""},{"$f":"IF( Input!R34=\"\",\"\",Input!R34)","v":""},{"$f":"IF( Input!AU34=\"\",\"\",Input!AU34)","v":""},{"$f":"IF( Input!AS34=\"\",\"\",Input!AS34)","v":""},{"$f":"IF( Input!BB34=\"\",\"\",Input!BB34)","v":""},{"$f":"IF(Input!AY34=\"\",\"\",Input!AY34)","v":""},{"$f":"IF(Input!AZ34=\"\",\"\",Input!AZ34)","v":""},null,{"$f":"IF(Input!AR34=\"\",\"\",Input!AR34)","v":""},{"$f":"IF(Input!B34=\"\",\"\",(Input!AN34*Input!AP34+Input!AO34*Input!AQ34)/SUM(Input!AN34:AO34))","v":""},{"$f":"IF(Input!K34=\"\",\"\",Input!K34)","v":""},{"$f":"IF(Input!A34=\"\",\"\",Input!A34)","v":""},{"$f":"IF(Input!AT34=\"\",\"\",Input!AT34)","v":""},{"$f":"IF(Input!BC34=\"\",\"\",Input!BC34)","v":""},{"$f":"IF(Input!BD34=\"\",\"\",Input!BD34)","v":""},{"$f":"IF(Input!BG34=\"\",\"\",Input!BG34)","v":""},{"$f":"IF(Input!AX34=\"\",\"\",Input!AX34)","v":""},{"$f":"IF(Input!V34=\"\",\"\",Input!V34)","v":""}]
["",{"$f":"IF( Input!B35=\"\",\"\",Input!B35)","v":""},{"$f":"IF( Input!C35=\"\",\"\",Input!C35)","v":""},{"$f":"IF( Input!E35=\"\",\"\",Input!E35)","v":""},{"$f":"IF( Input!F35=\"\",\"\",Input!F35)","v":""},{"$f":"IF( Input!G35=\"\",\"\",Input!G35)","v":""},{"$f":"IF( Input!F35=\"\",\"\",Input!F35*Input!Y35+Input!Z35)","v":""},{"$f":"IF( Input!H35=\"\",\"\",Input!H35)","v":""},{"$f":"IF( Input!I35=\"\",\"\",Input!I35)","v":""},{"$f":"IF( Input!AH35=\"\",\"\",Input!AH35)","v":""},{"$f":"IF( Input!AF35=\"\",\"\",Input!AF35)","v":""},{"$f":"IF( Input!L35=\"\",\"\",Input!L35)","v":""},{"$f":"IF( Input!N35=\"\",\"\",Input!N35)","v":""},{"$f":"IF( Input!O35=\"\",\"\",Input!O35)","v":""},{"$f":"IF( Input!P35=\"\",\"\",Input!P35)","v":""},{"$f":"IF( Input!O35=\"\",\"\",Input!O35*Input!AL35+Input!AM35)","v":""},{"$f":"IF( Input!Q35=\"\",\"\",Input!Q35)","v":""},{"$f":"IF( Input!R35=\"\",\"\",Input!R35)","v":""},{"$f":"IF( Input!AU35=\"\",\"\",Input!AU35)","v":""},{"$f":"IF( Input!AS35=\"\",\"\",Input!AS35)","v":""},{"$f":"IF( Input!BB35=\"\",\"\",Input!BB35)","v":""},{"$f":"IF(Input!AY35=\"\",\"\",Input!AY35)","v":""},{"$f":"IF(Input!AZ35=\"\",\"\",Input!AZ35)","v":""},null,{"$f":"IF(Input!AR35=\"\",\"\",Input!AR35)","v":""},{"$f":"IF(Input!B35=\"\",\"\",(Input!AN35*Input!AP35+Input!AO35*Input!AQ35)/SUM(Input!AN35:AO35))","v":""},{"$f":"IF(Input!K35=\"\",\"\",Input!K35)","v":""},{"$f":"IF(Input!A35=\"\",\"\",Input!A35)","v":""},{"$f":"IF(Input!AT35=\"\",\"\",Input!AT35)","v":""},{"$f":"IF(Input!BC35=\"\",\"\",Input!BC35)","v":""},{"$f":"IF(Input!BD35=\"\",\"\",Input!BD35)","v":""},{"$f":"IF(Input!BG35=\"\",\"\",Input!BG35)","v":""},{"$f":"IF(Input!AX35=\"\",\"\",Input!AX35)","v":""},{"$f":"IF(Input!V35=\"\",\"\",Input!V35)","v":""}]
["",{"$f":"IF( Input!B36=\"\",\"\",Input!B36)","v":""},{"$f":"IF( Input!C36=\"\",\"\",Input!C36)","v":""},{"$f":"IF( Input!E36=\"\",\"\",Input!E36)","v":""},{"$f":"IF( Input!F36=\"\",\"\",Input!F36)","v":""},{"$f":"IF( Input!G36=\"\",\"\",Input!G36)","v":""},{"$f":"IF( Input!F36=\"\",\"\",Input!F36*Input!Y36+Input!Z36)","v":""},{"$f":"IF( Input!H36=\"\",\"\",Input!H36)","v":""},{"$f":"IF( Input!I36=\"\",\"\",Input!I36)","v":""},{"$f":"IF( Input!AH36=\"\",\"\",Input!AH36)","v":""},{"$f":"IF( Input!AF36=\"\",\"\",Input!AF36)","v":""},{"$f":"IF( Input!L36=\"\",\"\",Input!L36)","v":""},{"$f":"IF( Input!N36=\"\",\"\",Input!N36)","v":""},{"$f":"IF( Input!O36=\"\",\"\",Input!O36)","v":""},{"$f":"IF( Input!P36=\"\",\"\",Input!P36)","v":""},{"$f":"IF( Input!O36=\"\",\"\",Input!O36*Input!AL36+Input!AM36)","v":""},{"$f":"IF( Input!Q36=\"\",\"\",Input!Q36)","v":""},{"$f":"IF( Input!R36=\"\",\"\",Input!R36)","v":""},{"$f":"IF( Input!AU36=\"\",\"\",Input!AU36)","v":""},{"$f":"IF( Input!AS36=\"\",\"\",Input!AS36)","v":""},{"$f":"IF( Input!BB36=\"\",\"\",Input!BB36)","v":""},{"$f":"IF(Input!AY36=\"\",\"\",Input!AY36)","v":""},{"$f":"IF(Input!AZ36=\"\",\"\",Input!AZ36)","v":""},null,{"$f":"IF(Input!AR36=\"\",\"\",Input!AR36)","v":""},{"$f":"IF(Input!B36=\"\",\"\",(Input!AN36*Input!AP36+Input!AO36*Input!AQ36)/SUM(Input!AN36:AO36))","v":""},{"$f":"IF(Input!K36=\"\",\"\",Input!K36)","v":""},{"$f":"IF(Input!A36=\"\",\"\",Input!A36)","v":""},{"$f":"IF(Input!AT36=\"\",\"\",Input!AT36)","v":""},{"$f":"IF(Input!BC36=\"\",\"\",Input!BC36)","v":""},{"$f":"IF(Input!BD36=\"\",\"\",Input!BD36)","v":""},{"$f":"IF(Input!BG36=\"\",\"\",Input!BG36)","v":""},{"$f":"IF(Input!AX36=\"\",\"\",Input!AX36)","v":""},{"$f":"IF(Input!V36=\"\",\"\",Input!V36)","v":""}]
["",{"$f":"IF( Input!B37=\"\",\"\",Input!B37)","v":""},{"$f":"IF( Input!C37=\"\",\"\",Input!C37)","v":""},{"$f":"IF( Input!E37=\"\",\"\",Input!E37)","v":""},{"$f":"IF( Input!F37=\"\",\"\",Input!F37)","v":""},{"$f":"IF( Input!G37=\"\",\"\",Input!G37)","v":""},{"$f":"IF( Input!F37=\"\",\"\",Input!F37*Input!Y37+Input!Z37)","v":""},{"$f":"IF( Input!H37=\"\",\"\",Input!H37)","v":""},{"$f":"IF( Input!I37=\"\",\"\",Input!I37)","v":""},{"$f":"IF( Input!AH37=\"\",\"\",Input!AH37)","v":""},{"$f":"IF( Input!AF37=\"\",\"\",Input!AF37)","v":""},{"$f":"IF( Input!L37=\"\",\"\",Input!L37)","v":""},{"$f":"IF( Input!N37=\"\",\"\",Input!N37)","v":""},{"$f":"IF( Input!O37=\"\",\"\",Input!O37)","v":""},{"$f":"IF( Input!P37=\"\",\"\",Input!P37)","v":""},{"$f":"IF( Input!O37=\"\",\"\",Input!O37*Input!AL37+Input!AM37)","v":""},{"$f":"IF( Input!Q37=\"\",\"\",Input!Q37)","v":""},{"$f":"IF( Input!R37=\"\",\"\",Input!R37)","v":""},{"$f":"IF( Input!AU37=\"\",\"\",Input!AU37)","v":""},{"$f":"IF( Input!AS37=\"\",\"\",Input!AS37)","v":""},{"$f":"IF( Input!BB37=\"\",\"\",Input!BB37)","v":""},{"$f":"IF(Input!AY37=\"\",\"\",Input!AY37)","v":""},{"$f":"IF(Input!AZ37=\"\",\"\",Input!AZ37)","v":""},null,{"$f":"IF(Input!AR37=\"\",\"\",Input!AR37)","v":""},{"$f":"IF(Input!B37=\"\",\"\",(Input!AN37*Input!AP37+Input!AO37*Input!AQ37)/SUM(Input!AN37:AO37))","v":""},{"$f":"IF(Input!K37=\"\",\"\",Input!K37)","v":""},{"$f":"IF(Input!A37=\"\",\"\",Input!A37)","v":""},{"$f":"IF(Input!AT37=\"\",\"\",Input!AT37)","v":""},{"$f":"IF(Input!BC37=\"\",\"\",Input!BC37)","v":""},{"$f":"IF(Input!BD37=\"\",\"\",Input!BD37)","v":""},{"$f":"IF(Input!BG37=\"\",\"\",Input!BG37)","v":""},{"$f":"IF(Input!AX37=\"\",\"\",Input!AX37)","v":""},{"$f":"IF(Input!V37=\"\",\"\",Input!V37)","v":""}]
["",{"$f":"IF( Input!B38=\"\",\"\",Input!B38)","v":""},{"$f":"IF( Input!C38=\"\",\"\",Input!C38)","v":""},{"$f":"IF( Input!E38=\"\",\"\",Input!E38)","v":""},{"$f":"IF( Input!F38=\"\",\"\",Input!F38)","v":""},{"$f":"IF( Input!G38=\"\",\"\",Input!G38)","v":""},{"$f":"IF( Input!F38=\"\",\"\",Input!F38*Input!Y38+Input!Z38)","v":""},{"$f":"IF( Input!H38=\"\",\"\",Input!H38)","v":""},{"$f":"IF( Input!I38=\"\",\"\",Input!I38)","v":""},{"$f":"IF( Input!AH38=\"\",\"\",Input!AH38)","v":""},{"$f":"IF( Input!AF38=\"\",\"\",Input!AF38)","v":""},{"$f":"IF( Input!L38=\"\",\"\",Input!L38)","v":""},{"$f":"IF( Input!N38=\"\",\"\",Input!N38)","v":""},{"$f":"IF( Input!O38=\"\",\"\",Input!O38)","v":""},{"$f":"IF( Input!P38=\"\",\"\",Input!P38)","v":""},{"$f":"IF( Input!O38=\"\",\"\",Input!O38*Input!AL38+Input!AM38)","v":""},{"$f":"IF( Input!Q38=\"\",\"\",Input!Q38)","v":""},{"$f":"IF( Input!R38=\"\",\"\",Input!R38)","v":""},{"$f":"IF( Input!AU38=\"\",\"\",Input!AU38)","v":""},{"$f":"IF( Input!AS38=\"\",\"\",Input!AS38)","v":""},{"$f":"IF( Input!BB38=\"\",\"\",Input!BB38)","v":""},{"$f":"IF(Input!AY38=\"\",\"\",Input!AY38)","v":""},{"$f":"IF(Input!AZ38=\"\",\"\",Input!AZ38)","v":""},null,{"$f":"IF(Input!AR38=\"\",\"\",Input!AR38)","v":""},{"$f":"IF(Input!B38=\"\",\"\",(Input!AN38*Input!AP38+Input!AO38*Input!AQ38)/SUM(Input!AN38:AO38))","v":""},{"$f":"IF(Input!K38=\"\",\"\",Input!K38)","v":""},{"$f":"IF(Input!A38=\"\",\"\",Input!A38)","v":""},{"$f":"IF(Input!AT38=\"\",\"\",Input!AT38)","v":""},{"$f":"IF(Input!BC38=\"\",\"\",Input!BC38)","v":""},{"$f":"IF(Input!BD38=\"\",\"\",Input!BD38)","v":""},{"$f":"IF(Input!BG38=\"\",\"\",Input!BG38)","v":""},{"$f":"IF(Input!AX38=\"\",\"\",Input!AX38)","v":""},{"$f":"IF(Input!V38=\"\",\"\",Input!V38)","v":""}]
["",{"$f":"IF( Input!B39=\"\",\"\",Input!B39)","v":""},{"$f":"IF( Input!C39=\"\",\"\",Input!C39)","v":""},{"$f":"IF( Input!E39=\"\",\"\",Input!E39)","v":""},{"$f":"IF( Input!F39=\"\",\"\",Input!F39)","v":""},{"$f":"IF( Input!G39=\"\",\"\",Input!G39)","v":""},{"$f":"IF( Input!F39=\"\",\"\",Input!F39*Input!Y39+Input!Z39)","v":""},{"$f":"IF( Input!H39=\"\",\"\",Input!H39)","v":""},{"$f":"IF( Input!I39=\"\",\"\",Input!I39)","v":""},{"$f":"IF( Input!AH39=\"\",\"\",Input!AH39)","v":""},{"$f":"IF( Input!AF39=\"\",\"\",Input!AF39)","v":""},{"$f":"IF( Input!L39=\"\",\"\",Input!L39)","v":""},{"$f":"IF( Input!N39=\"\",\"\",Input!N39)","v":""},{"$f":"IF( Input!O39=\"\",\"\",Input!O39)","v":""},{"$f":"IF( Input!P39=\"\",\"\",Input!P39)","v":""},{"$f":"IF( Input!O39=\"\",\"\",Input!O39*Input!AL39+Input!AM39)","v":""},{"$f":"IF( Input!Q39=\"\",\"\",Input!Q39)","v":""},{"$f":"IF( Input!R39=\"\",\"\",Input!R39)","v":""},{"$f":"IF( Input!AU39=\"\",\"\",Input!AU39)","v":""},{"$f":"IF( Input!AS39=\"\",\"\",Input!AS39)","v":""},{"$f":"IF( Input!BB39=\"\",\"\",Input!BB39)","v":""},{"$f":"IF(Input!AY39=\"\",\"\",Input!AY39)","v":""},{"$f":"IF(Input!AZ39=\"\",\"\",Input!AZ39)","v":""},null,{"$f":"IF(Input!AR39=\"\",\"\",Input!AR39)","v":""},{"$f":"IF(Input!B39=\"\",\"\",(Input!AN39*Input!AP39+Input!AO39*Input!AQ39)/SUM(Input!AN39:AO39))","v":""},{"$f":"IF(Input!K39=\"\",\"\",Input!K39)","v":""},{"$f":"IF(Input!A39=\"\",\"\",Input!A39)","v":""},{"$f":"IF(Input!AT39=\"\",\"\",Input!AT39)","v":""},{"$f":"IF(Input!BC39=\"\",\"\",Input!BC39)","v":""},{"$f":"IF(Input!BD39=\"\",\"\",Input!BD39)","v":""},{"$f":"IF(Input!BG39=\"\",\"\",Input!BG39)","v":""},{"$f":"IF(Input!AX39=\"\",\"\",Input!AX39)","v":""},{"$f":"IF(Input!V39=\"\",\"\",Input!V39)","v":""}]
["",{"$f":"IF( Input!B40=\"\",\"\",Input!B40)","v":""},{"$f":"IF( Input!C40=\"\",\"\",Input!C40)","v":""},{"$f":"IF( Input!E40=\"\",\"\",Input!E40)","v":""},{"$f":"IF( Input!F40=\"\",\"\",Input!F40)","v":""},{"$f":"IF( Input!G40=\"\",\"\",Input!G40)","v":""},{"$f":"IF( Input!F40=\"\",\"\",Input!F40*Input!Y40+Input!Z40)","v":""},{"$f":"IF( Input!H40=\"\",\"\",Input!H40)","v":""},{"$f":"IF( Input!I40=\"\",\"\",Input!I40)","v":""},{"$f":"IF( Input!AH40=\"\",\"\",Input!AH40)","v":""},{"$f":"IF( Input!AF40=\"\",\"\",Input!AF40)","v":""},{"$f":"IF( Input!L40=\"\",\"\",Input!L40)","v":""},{"$f":"IF( Input!N40=\"\",\"\",Input!N40)","v":""},{"$f":"IF( Input!O40=\"\",\"\",Input!O40)","v":""},{"$f":"IF( Input!P40=\"\",\"\",Input!P40)","v":""},{"$f":"IF( Input!O40=\"\",\"\",Input!O40*Input!AL40+Input!AM40)","v":""},{"$f":"IF( Input!Q40=\"\",\"\",Input!Q40)","v":""},{"$f":"IF( Input!R40=\"\",\"\",Input!R40)","v":""},{"$f":"IF( Input!AU40=\"\",\"\",Input!AU40)","v":""},{"$f":"IF( Input!AS40=\"\",\"\",Input!AS40)","v":""},{"$f":"IF( Input!BB40=\"\",\"\",Input!BB40)","v":""},{"$f":"IF(Input!AY40=\"\",\"\",Input!AY40)","v":""},{"$f":"IF(Input!AZ40=\"\",\"\",Input!AZ40)","v":""},null,{"$f":"IF(Input!AR40=\"\",\"\",Input!AR40)","v":""},{"$f":"IF(Input!B40=\"\",\"\",(Input!AN40*Input!AP40+Input!AO40*Input!AQ40)/SUM(Input!AN40:AO40))","v":""},{"$f":"IF(Input!K40=\"\",\"\",Input!K40)","v":""},{"$f":"IF(Input!A40=\"\",\"\",Input!A40)","v":""},{"$f":"IF(Input!AT40=\"\",\"\",Input!AT40)","v":""},{"$f":"IF(Input!BC40=\"\",\"\",Input!BC40)","v":""},{"$f":"IF(Input!BD40=\"\",\"\",Input!BD40)","v":""},{"$f":"IF(Input!BG40=\"\",\"\",Input!BG40)","v":""},{"$f":"IF(Input!AX40=\"\",\"\",Input!AX40)","v":""},{"$f":"IF(Input!V40=\"\",\"\",Input!V40)","v":""}]
["",{"$f":"IF( Input!B41=\"\",\"\",Input!B41)","v":""},{"$f":"IF( Input!C41=\"\",\"\",Input!C41)","v":""},{"$f":"IF( Input!E41=\"\",\"\",Input!E41)","v":""},{"$f":"IF( Input!F41=\"\",\"\",Input!F41)","v":""},{"$f":"IF( Input!G41=\"\",\"\",Input!G41)","v":""},{"$f":"IF( Input!F41=\"\",\"\",Input!F41*Input!Y41+Input!Z41)","v":""},{"$f":"IF( Input!H41=\"\",\"\",Input!H41)","v":""},{"$f":"IF( Input!I41=\"\",\"\",Input!I41)","v":""},{"$f":"IF( Input!AH41=\"\",\"\",Input!AH41)","v":""},{"$f":"IF( Input!AF41=\"\",\"\",Input!AF41)","v":""},{"$f":"IF( Input!L41=\"\",\"\",Input!L41)","v":""},{"$f":"IF( Input!N41=\"\",\"\",Input!N41)","v":""},{"$f":"IF( Input!O41=\"\",\"\",Input!O41)","v":""},{"$f":"IF( Input!P41=\"\",\"\",Input!P41)","v":""},{"$f":"IF( Input!O41=\"\",\"\",Input!O41*Input!AL41+Input!AM41)","v":""},{"$f":"IF( Input!Q41=\"\",\"\",Input!Q41)","v":""},{"$f":"IF( Input!R41=\"\",\"\",Input!R41)","v":""},{"$f":"IF( Input!AU41=\"\",\"\",Input!AU41)","v":""},{"$f":"IF( Input!AS41=\"\",\"\",Input!AS41)","v":""},{"$f":"IF( Input!BB41=\"\",\"\",Input!BB41)","v":""},{"$f":"IF(Input!AY41=\"\",\"\",Input!AY41)","v":""},{"$f":"IF(Input!AZ41=\"\",\"\",Input!AZ41)","v":""},null,{"$f":"IF(Input!AR41=\"\",\"\",Input!AR41)","v":""},{"$f":"IF(Input!B41=\"\",\"\",(Input!AN41*Input!AP41+Input!AO41*Input!AQ41)/SUM(Input!AN41:AO41))","v":""},{"$f":"IF(Input!K41=\"\",\"\",Input!K41)","v":""},{"$f":"IF(Input!A41=\"\",\"\",Input!A41)","v":""},{"$f":"IF(Input!AT41=\"\",\"\",Input!AT41)","v":""},{"$f":"IF(Input!BC41=\"\",\"\",Input!BC41)","v":""},{"$f":"IF(Input!BD41=\"\",\"\",Input!BD41)","v":""},{"$f":"IF(Input!BG41=\"\",\"\",Input!BG41)","v":""},{"$f":"IF(Input!AX41=\"\",\"\",Input!AX41)","v":""},{"$f":"IF(Input!V41=\"\",\"\",Input!V41)","v":""}]
["",{"$f":"IF( Input!B42=\"\",\"\",Input!B42)","v":""},{"$f":"IF( Input!C42=\"\",\"\",Input!C42)","v":""},{"$f":"IF( Input!E42=\"\",\"\",Input!E42)","v":""},{"$f":"IF( Input!F42=\"\",\"\",Input!F42)","v":""},{"$f":"IF( Input!G42=\"\",\"\",Input!G42)","v":""},{"$f":"IF( Input!F42=\"\",\"\",Input!F42*Input!Y42+Input!Z42)","v":""},{"$f":"IF( Input!H42=\"\",\"\",Input!H42)","v":""},{"$f":"IF( Input!I42=\"\",\"\",Input!I42)","v":""},{"$f":"IF( Input!AH42=\"\",\"\",Input!AH42)","v":""},{"$f":"IF( Input!AF42=\"\",\"\",Input!AF42)","v":""},{"$f":"IF( Input!L42=\"\",\"\",Input!L42)","v":""},{"$f":"IF( Input!N42=\"\",\"\",Input!N42)","v":""},{"$f":"IF( Input!O42=\"\",\"\",Input!O42)","v":""},{"$f":"IF( Input!P42=\"\",\"\",Input!P42)","v":""},{"$f":"IF( Input!O42=\"\",\"\",Input!O42*Input!AL42+Input!AM42)","v":""},{"$f":"IF( Input!Q42=\"\",\"\",Input!Q42)","v":""},{"$f":"IF( Input!R42=\"\",\"\",Input!R42)","v":""},{"$f":"IF( Input!AU42=\"\",\"\",Input!AU42)","v":""},{"$f":"IF( Input!AS42=\"\",\"\",Input!AS42)","v":""},{"$f":"IF( Input!BB42=\"\",\"\",Input!BB42)","v":""},{"$f":"IF(Input!AY42=\"\",\"\",Input!AY42)","v":""},{"$f":"IF(Input!AZ42=\"\",\"\",Input!AZ42)","v":""},null,{"$f":"IF(Input!AR42=\"\",\"\",Input!AR42)","v":""},{"$f":"IF(Input!B42=\"\",\"\",(Input!AN42*Input!AP42+Input!AO42*Input!AQ42)/SUM(Input!AN42:AO42))","v":""},{"$f":"IF(Input!K42=\"\",\"\",Input!K42)","v":""},{"$f":"IF(Input!A42=\"\",\"\",Input!A42)","v":""},{"$f":"IF(Input!AT42=\"\",\"\",Input!AT42)","v":""},{"$f":"IF(Input!BC42=\"\",\"\",Input!BC42)","v":""},{"$f":"IF(Input!BD42=\"\",\"\",Input!BD42)","v":""},{"$f":"IF(Input!BG42=\"\",\"\",Input!BG42)","v":""},{"$f":"IF(Input!AX42=\"\",\"\",Input!AX42)","v":""},{"$f":"IF(Input!V42=\"\",\"\",Input!V42)","v":""}]
["",{"$f":"IF( Input!B43=\"\",\"\",Input!B43)","v":""},{"$f":"IF( Input!C43=\"\",\"\",Input!C43)","v":""},{"$f":"IF( Input!E43=\"\",\"\",Input!E43)","v":""},{"$f":"IF( Input!F43=\"\",\"\",Input!F43)","v":""},{"$f":"IF( Input!G43=\"\",\"\",Input!G43)","v":""},{"$f":"IF( Input!F43=\"\",\"\",Input!F43*Input!Y43+Input!Z43)","v":""},{"$f":"IF( Input!H43=\"\",\"\",Input!H43)","v":""},{"$f":"IF( Input!I43=\"\",\"\",Input!I43)","v":""},{"$f":"IF( Input!AH43=\"\",\"\",Input!AH43)","v":""},{"$f":"IF( Input!AF43=\"\",\"\",Input!AF43)","v":""},{"$f":"IF( Input!L43=\"\",\"\",Input!L43)","v":""},{"$f":"IF( Input!N43=\"\",\"\",Input!N43)","v":""},{"$f":"IF( Input!O43=\"\",\"\",Input!O43)","v":""},{"$f":"IF( Input!P43=\"\",\"\",Input!P43)","v":""},{"$f":"IF( Input!O43=\"\",\"\",Input!O43*Input!AL43+Input!AM43)","v":""},{"$f":"IF( Input!Q43=\"\",\"\",Input!Q43)","v":""},{"$f":"IF( Input!R43=\"\",\"\",Input!R43)","v":""},{"$f":"IF( Input!AU43=\"\",\"\",Input!AU43)","v":""},{"$f":"IF( Input!AS43=\"\",\"\",Input!AS43)","v":""},{"$f":"IF( Input!BB43=\"\",\"\",Input!BB43)","v":""},{"$f":"IF(Input!AY43=\"\",\"\",Input!AY43)","v":""},{"$f":"IF(Input!AZ43=\"\",\"\",Input!AZ43)","v":""},null,{"$f":"IF(Input!AR43=\"\",\"\",Input!AR43)","v":""},{"$f":"IF(Input!B43=\"\",\"\",(Input!AN43*Input!AP43+Input!AO43*Input!AQ43)/SUM(Input!AN43:AO43))","v":""},{"$f":"IF(Input!K43=\"\",\"\",Input!K43)","v":""},{"$f":"IF(Input!A43=\"\",\"\",Input!A43)","v":""},{"$f":"IF(Input!AT43=\"\",\"\",Input!AT43)","v":""},{"$f":"IF(Input!BC43=\"\",\"\",Input!BC43)","v":""},{"$f":"IF(Input!BD43=\"\",\"\",Input!BD43)","v":""},{"$f":"IF(Input!BG43=\"\",\"\",Input!BG43)","v":""},{"$f":"IF(Input!AX43=\"\",\"\",Input!AX43)","v":""},{"$f":"IF(Input!V43=\"\",\"\",Input!V43)","v":""}]
["",{"$f":"IF( Input!B44=\"\",\"\",Input!B44)","v":""},{"$f":"IF( Input!C44=\"\",\"\",Input!C44)","v":""},{"$f":"IF( Input!E44=\"\",\"\",Input!E44)","v":""},{"$f":"IF( Input!F44=\"\",\"\",Input!F44)","v":""},{"$f":"IF( Input!G44=\"\",\"\",Input!G44)","v":""},{"$f":"IF( Input!F44=\"\",\"\",Input!F44*Input!Y44+Input!Z44)","v":""},{"$f":"IF( Input!H44=\"\",\"\",Input!H44)","v":""},{"$f":"IF( Input!I44=\"\",\"\",Input!I44)","v":""},{"$f":"IF( Input!AH44=\"\",\"\",Input!AH44)","v":""},{"$f":"IF( Input!AF44=\"\",\"\",Input!AF44)","v":""},{"$f":"IF( Input!L44=\"\",\"\",Input!L44)","v":""},{"$f":"IF( Input!N44=\"\",\"\",Input!N44)","v":""},{"$f":"IF( Input!O44=\"\",\"\",Input!O44)","v":""},{"$f":"IF( Input!P44=\"\",\"\",Input!P44)","v":""},{"$f":"IF( Input!O44=\"\",\"\",Input!O44*Input!AL44+Input!AM44)","v":""},{"$f":"IF( Input!Q44=\"\",\"\",Input!Q44)","v":""},{"$f":"IF( Input!R44=\"\",\"\",Input!R44)","v":""},{"$f":"IF( Input!AU44=\"\",\"\",Input!AU44)","v":""},{"$f":"IF( Input!AS44=\"\",\"\",Input!AS44)","v":""},{"$f":"IF( Input!BB44=\"\",\"\",Input!BB44)","v":""},{"$f":"IF(Input!AY44=\"\",\"\",Input!AY44)","v":""},{"$f":"IF(Input!AZ44=\"\",\"\",Input!AZ44)","v":""},null,{"$f":"IF(Input!AR44=\"\",\"\",Input!AR44)","v":""},{"$f":"IF(Input!B44=\"\",\"\",(Input!AN44*Input!AP44+Input!AO44*Input!AQ44)/SUM(Input!AN44:AO44))","v":""},{"$f":"IF(Input!K44=\"\",\"\",Input!K44)","v":""},{"$f":"IF(Input!A44=\"\",\"\",Input!A44)","v":""},{"$f":"IF(Input!AT44=\"\",\"\",Input!AT44)","v":""},{"$f":"IF(Input!BC44=\"\",\"\",Input!BC44)","v":""},{"$f":"IF(Input!BD44=\"\",\"\",Input!BD44)","v":""},{"$f":"IF(Input!BG44=\"\",\"\",Input!BG44)","v":""},{"$f":"IF(Input!AX44=\"\",\"\",Input!AX44)","v":""},{"$f":"IF(Input!V44=\"\",\"\",Input!V44)","v":""}]
["",{"$f":"IF( Input!B45=\"\",\"\",Input!B45)","v":""},{"$f":"IF( Input!C45=\"\",\"\",Input!C45)","v":""},{"$f":"IF( Input!E45=\"\",\"\",Input!E45)","v":""},{"$f":"IF( Input!F45=\"\",\"\",Input!F45)","v":""},{"$f":"IF( Input!G45=\"\",\"\",Input!G45)","v":""},{"$f":"IF( Input!F45=\"\",\"\",Input!F45*Input!Y45+Input!Z45)","v":""},{"$f":"IF( Input!H45=\"\",\"\",Input!H45)","v":""},{"$f":"IF( Input!I45=\"\",\"\",Input!I45)","v":""},{"$f":"IF( Input!AH45=\"\",\"\",Input!AH45)","v":""},{"$f":"IF( Input!AF45=\"\",\"\",Input!AF45)","v":""},{"$f":"IF( Input!L45=\"\",\"\",Input!L45)","v":""},{"$f":"IF( Input!N45=\"\",\"\",Input!N45)","v":""},{"$f":"IF( Input!O45=\"\",\"\",Input!O45)","v":""},{"$f":"IF( Input!P45=\"\",\"\",Input!P45)","v":""},{"$f":"IF( Input!O45=\"\",\"\",Input!O45*Input!AL45+Input!AM45)","v":""},{"$f":"IF( Input!Q45=\"\",\"\",Input!Q45)","v":""},{"$f":"IF( Input!R45=\"\",\"\",Input!R45)","v":""},{"$f":"IF( Input!AU45=\"\",\"\",Input!AU45)","v":""},{"$f":"IF( Input!AS45=\"\",\"\",Input!AS45)","v":""},{"$f":"IF( Input!BB45=\"\",\"\",Input!BB45)","v":""},{"$f":"IF(Input!AY45=\"\",\"\",Input!AY45)","v":""},{"$f":"IF(Input!AZ45=\"\",\"\",Input!AZ45)","v":""},null,{"$f":"IF(Input!AR45=\"\",\"\",Input!AR45)","v":""},{"$f":"IF(Input!B45=\"\",\"\",(Input!AN45*Input!AP45+Input!AO45*Input!AQ45)/SUM(Input!AN45:AO45))","v":""},{"$f":"IF(Input!K45=\"\",\"\",Input!K45)","v":""},{"$f":"IF(Input!A45=\"\",\"\",Input!A45)","v":""},{"$f":"IF(Input!AT45=\"\",\"\",Input!AT45)","v":""},{"$f":"IF(Input!BC45=\"\",\"\",Input!BC45)","v":""},{"$f":"IF(Input!BD45=\"\",\"\",Input!BD45)","v":""},{"$f":"IF(Input!BG45=\"\",\"\",Input!BG45)","v":""},{"$f":"IF(Input!AX45=\"\",\"\",Input!AX45)","v":""},{"$f":"IF(Input!V45=\"\",\"\",Input!V45)","v":""}]
["",{"$f":"IF( Input!B46=\"\",\"\",Input!B46)","v":""},{"$f":"IF( Input!C46=\"\",\"\",Input!C46)","v":""},{"$f":"IF( Input!E46=\"\",\"\",Input!E46)","v":""},{"$f":"IF( Input!F46=\"\",\"\",Input!F46)","v":""},{"$f":"IF( Input!G46=\"\",\"\",Input!G46)","v":""},{"$f":"IF( Input!F46=\"\",\"\",Input!F46*Input!Y46+Input!Z46)","v":""},{"$f":"IF( Input!H46=\"\",\"\",Input!H46)","v":""},{"$f":"IF( Input!I46=\"\",\"\",Input!I46)","v":""},{"$f":"IF( Input!AH46=\"\",\"\",Input!AH46)","v":""},{"$f":"IF( Input!AF46=\"\",\"\",Input!AF46)","v":""},{"$f":"IF( Input!L46=\"\",\"\",Input!L46)","v":""},{"$f":"IF( Input!N46=\"\",\"\",Input!N46)","v":""},{"$f":"IF( Input!O46=\"\",\"\",Input!O46)","v":""},{"$f":"IF( Input!P46=\"\",\"\",Input!P46)","v":""},{"$f":"IF( Input!O46=\"\",\"\",Input!O46*Input!AL46+Input!AM46)","v":""},{"$f":"IF( Input!Q46=\"\",\"\",Input!Q46)","v":""},{"$f":"IF( Input!R46=\"\",\"\",Input!R46)","v":""},{"$f":"IF( Input!AU46=\"\",\"\",Input!AU46)","v":""},{"$f":"IF( Input!AS46=\"\",\"\",Input!AS46)","v":""},{"$f":"IF( Input!BB46=\"\",\"\",Input!BB46)","v":""},{"$f":"IF(Input!AY46=\"\",\"\",Input!AY46)","v":""},{"$f":"IF(Input!AZ46=\"\",\"\",Input!AZ46)","v":""},null,{"$f":"IF(Input!AR46=\"\",\"\",Input!AR46)","v":""},{"$f":"IF(Input!B46=\"\",\"\",(Input!AN46*Input!AP46+Input!AO46*Input!AQ46)/SUM(Input!AN46:AO46))","v":""},{"$f":"IF(Input!K46=\"\",\"\",Input!K46)","v":""},{"$f":"IF(Input!A46=\"\",\"\",Input!A46)","v":""},{"$f":"IF(Input!AT46=\"\",\"\",Input!AT46)","v":""},{"$f":"IF(Input!BC46=\"\",\"\",Input!BC46)","v":""},{"$f":"IF(Input!BD46=\"\",\"\",Input!BD46)","v":""},{"$f":"IF(Input!BG46=\"\",\"\",Input!BG46)","v":""},{"$f":"IF(Input!AX46=\"\",\"\",Input!AX46)","v":""},{"$f":"IF(Input!V46=\"\",\"\",Input!V46)","v":""}]
["",{"$f":"IF( Input!B47=\"\",\"\",Input!B47)","v":""},{"$f":"IF( Input!C47=\"\",\"\",Input!C47)","v":""},{"$f":"IF( Input!E47=\"\",\"\",Input!E47)","v":""},{"$f":"IF( Input!F47=\"\",\"\",Input!F47)","v":""},{"$f":"IF( Input!G47=\"\",\"\",Input!G47)","v":""},{"$f":"IF( Input!F47=\"\",\"\",Input!F47*Input!Y47+Input!Z47)","v":""},{"$f":"IF( Input!H47=\"\",\"\",Input!H47)","v":""},{"$f":"IF( Input!I47=\"\",\"\",Input!I47)","v":""},{"$f":"IF( Input!AH47=\"\",\"\",Input!AH47)","v":""},{"$f":"IF( Input!AF47=\"\",\"\",Input!AF47)","v":""},{"$f":"IF( Input!L47=\"\",\"\",Input!L47)","v":""},{"$f":"IF( Input!N47=\"\",\"\",Input!N47)","v":""},{"$f":"IF( Input!O47=\"\",\"\",Input!O47)","v":""},{"$f":"IF( Input!P47=\"\",\"\",Input!P47)","v":""},{"$f":"IF( Input!O47=\"\",\"\",Input!O47*Input!AL47+Input!AM47)","v":""},{"$f":"IF( Input!Q47=\"\",\"\",Input!Q47)","v":""},{"$f":"IF( Input!R47=\"\",\"\",Input!R47)","v":""},{"$f":"IF( Input!AU47=\"\",\"\",Input!AU47)","v":""},{"$f":"IF( Input!AS47=\"\",\"\",Input!AS47)","v":""},{"$f":"IF( Input!BB47=\"\",\"\",Input!BB47)","v":""},{"$f":"IF(Input!AY47=\"\",\"\",Input!AY47)","v":""},{"$f":"IF(Input!AZ47=\"\",\"\",Input!AZ47)","v":""},null,{"$f":"IF(Input!AR47=\"\",\"\",Input!AR47)","v":""},{"$f":"IF(Input!B47=\"\",\"\",(Input!AN47*Input!AP47+Input!AO47*Input!AQ47)/SUM(Input!AN47:AO47))","v":""},{"$f":"IF(Input!K47=\"\",\"\",Input!K47)","v":""},{"$f":"IF(Input!A47=\"\",\"\",Input!A47)","v":""},{"$f":"IF(Input!AT47=\"\",\"\",Input!AT47)","v":""},{"$f":"IF(Input!BC47=\"\",\"\",Input!BC47)","v":""},{"$f":"IF(Input!BD47=\"\",\"\",Input!BD47)","v":""},{"$f":"IF(Input!BG47=\"\",\"\",Input!BG47)","v":""},{"$f":"IF(Input!AX47=\"\",\"\",Input!AX47)","v":""},{"$f":"IF(Input!V47=\"\",\"\",Input!V47)","v":""}]
["",{"$f":"IF( Input!B48=\"\",\"\",Input!B48)","v":""},{"$f":"IF( Input!C48=\"\",\"\",Input!C48)","v":""},{"$f":"IF( Input!E48=\"\",\"\",Input!E48)","v":""},{"$f":"IF( Input!F48=\"\",\"\",Input!F48)","v":""},{"$f":"IF( Input!G48=\"\",\"\",Input!G48)","v":""},{"$f":"IF( Input!F48=\"\",\"\",Input!F48*Input!Y48+Input!Z48)","v":""},{"$f":"IF( Input!H48=\"\",\"\",Input!H48)","v":""},{"$f":"IF( Input!I48=\"\",\"\",Input!I48)","v":""},{"$f":"IF( Input!AH48=\"\",\"\",Input!AH48)","v":""},{"$f":"IF( Input!AF48=\"\",\"\",Input!AF48)","v":""},{"$f":"IF( Input!L48=\"\",\"\",Input!L48)","v":""},{"$f":"IF( Input!N48=\"\",\"\",Input!N48)","v":""},{"$f":"IF( Input!O48=\"\",\"\",Input!O48)","v":""},{"$f":"IF( Input!P48=\"\",\"\",Input!P48)","v":""},{"$f":"IF( Input!O48=\"\",\"\",Input!O48*Input!AL48+Input!AM48)","v":""},{"$f":"IF( Input!Q48=\"\",\"\",Input!Q48)","v":""},{"$f":"IF( Input!R48=\"\",\"\",Input!R48)","v":""},{"$f":"IF( Input!AU48=\"\",\"\",Input!AU48)","v":""},{"$f":"IF( Input!AS48=\"\",\"\",Input!AS48)","v":""},{"$f":"IF( Input!BB48=\"\",\"\",Input!BB48)","v":""},{"$f":"IF(Input!AY48=\"\",\"\",Input!AY48)","v":""},{"$f":"IF(Input!AZ48=\"\",\"\",Input!AZ48)","v":""},null,{"$f":"IF(Input!AR48=\"\",\"\",Input!AR48)","v":""},{"$f":"IF(Input!B48=\"\",\"\",(Input!AN48*Input!AP48+Input!AO48*Input!AQ48)/SUM(Input!AN48:AO48))","v":""},{"$f":"IF(Input!K48=\"\",\"\",Input!K48)","v":""},{"$f":"IF(Input!A48=\"\",\"\",Input!A48)","v":""},{"$f":"IF(Input!AT48=\"\",\"\",Input!AT48)","v":""},{"$f":"IF(Input!BC48=\"\",\"\",Input!BC48)","v":""},{"$f":"IF(Input!BD48=\"\",\"\",Input!BD48)","v":""},{"$f":"IF(Input!BG48=\"\",\"\",Input!BG48)","v":""},{"$f":"IF(Input!AX48=\"\",\"\",Input!AX48)","v":""},{"$f":"IF(Input!V48=\"\",\"\",Input!V48)","v":""}]
["",{"$f":"IF( Input!B49=\"\",\"\",Input!B49)","v":""},{"$f":"IF( Input!C49=\"\",\"\",Input!C49)","v":""},{"$f":"IF( Input!E49=\"\",\"\",Input!E49)","v":""},{"$f":"IF( Input!F49=\"\",\"\",Input!F49)","v":""},{"$f":"IF( Input!G49=\"\",\"\",Input!G49)","v":""},{"$f":"IF( Input!F49=\"\",\"\",Input!F49*Input!Y49+Input!Z49)","v":""},{"$f":"IF( Input!H49=\"\",\"\",Input!H49)","v":""},{"$f":"IF( Input!I49=\"\",\"\",Input!I49)","v":""},{"$f":"IF( Input!AH49=\"\",\"\",Input!AH49)","v":""},{"$f":"IF( Input!AF49=\"\",\"\",Input!AF49)","v":""},{"$f":"IF( Input!L49=\"\",\"\",Input!L49)","v":""},{"$f":"IF( Input!N49=\"\",\"\",Input!N49)","v":""},{"$f":"IF( Input!O49=\"\",\"\",Input!O49)","v":""},{"$f":"IF( Input!P49=\"\",\"\",Input!P49)","v":""},{"$f":"IF( Input!O49=\"\",\"\",Input!O49*Input!AL49+Input!AM49)","v":""},{"$f":"IF( Input!Q49=\"\",\"\",Input!Q49)","v":""},{"$f":"IF( Input!R49=\"\",\"\",Input!R49)","v":""},{"$f":"IF( Input!AU49=\"\",\"\",Input!AU49)","v":""},{"$f":"IF( Input!AS49=\"\",\"\",Input!AS49)","v":""},{"$f":"IF( Input!BB49=\"\",\"\",Input!BB49)","v":""},{"$f":"IF(Input!AY49=\"\",\"\",Input!AY49)","v":""},{"$f":"IF(Input!AZ49=\"\",\"\",Input!AZ49)","v":""},null,{"$f":"IF(Input!AR49=\"\",\"\",Input!AR49)","v":""},{"$f":"IF(Input!B49=\"\",\"\",(Input!AN49*Input!AP49+Input!AO49*Input!AQ49)/SUM(Input!AN49:AO49))","v":""},{"$f":"IF(Input!K49=\"\",\"\",Input!K49)","v":""},{"$f":"IF(Input!A49=\"\",\"\",Input!A49)","v":""},{"$f":"IF(Input!AT49=\"\",\"\",Input!AT49)","v":""},{"$f":"IF(Input!BC49=\"\",\"\",Input!BC49)","v":""},{"$f":"IF(Input!BD49=\"\",\"\",Input!BD49)","v":""},{"$f":"IF(Input!BG49=\"\",\"\",Input!BG49)","v":""},{"$f":"IF(Input!AX49=\"\",\"\",Input!AX49)","v":""},{"$f":"IF(Input!V49=\"\",\"\",Input!V49)","v":""}]
["",{"$f":"IF( Input!B50=\"\",\"\",Input!B50)","v":""},{"$f":"IF( Input!C50=\"\",\"\",Input!C50)","v":""},{"$f":"IF( Input!E50=\"\",\"\",Input!E50)","v":""},{"$f":"IF( Input!F50=\"\",\"\",Input!F50)","v":""},{"$f":"IF( Input!G50=\"\",\"\",Input!G50)","v":""},{"$f":"IF( Input!F50=\"\",\"\",Input!F50*Input!Y50+Input!Z50)","v":""},{"$f":"IF( Input!H50=\"\",\"\",Input!H50)","v":""},{"$f":"IF( Input!I50=\"\",\"\",Input!I50)","v":""},{"$f":"IF( Input!AH50=\"\",\"\",Input!AH50)","v":""},{"$f":"IF( Input!AF50=\"\",\"\",Input!AF50)","v":""},{"$f":"IF( Input!L50=\"\",\"\",Input!L50)","v":""},{"$f":"IF( Input!N50=\"\",\"\",Input!N50)","v":""},{"$f":"IF( Input!O50=\"\",\"\",Input!O50)","v":""},{"$f":"IF( Input!P50=\"\",\"\",Input!P50)","v":""},{"$f":"IF( Input!O50=\"\",\"\",Input!O50*Input!AL50+Input!AM50)","v":""},{"$f":"IF( Input!Q50=\"\",\"\",Input!Q50)","v":""},{"$f":"IF( Input!R50=\"\",\"\",Input!R50)","v":""},{"$f":"IF( Input!AU50=\"\",\"\",Input!AU50)","v":""},{"$f":"IF( Input!AS50=\"\",\"\",Input!AS50)","v":""},{"$f":"IF( Input!BB50=\"\",\"\",Input!BB50)","v":""},{"$f":"IF(Input!AY50=\"\",\"\",Input!AY50)","v":""},{"$f":"IF(Input!AZ50=\"\",\"\",Input!AZ50)","v":""},null,{"$f":"IF(Input!AR50=\"\",\"\",Input!AR50)","v":""},{"$f":"IF(Input!B50=\"\",\"\",(Input!AN50*Input!AP50+Input!AO50*Input!AQ50)/SUM(Input!AN50:AO50))","v":""},{"$f":"IF(Input!K50=\"\",\"\",Input!K50)","v":""},{"$f":"IF(Input!A50=\"\",\"\",Input!A50)","v":""},{"$f":"IF(Input!AT50=\"\",\"\",Input!AT50)","v":""},{"$f":"IF(Input!BC50=\"\",\"\",Input!BC50)","v":""},{"$f":"IF(Input!BD50=\"\",\"\",Input!BD50)","v":""},{"$f":"IF(Input!BG50=\"\",\"\",Input!BG50)","v":""},{"$f":"IF(Input!AX50=\"\",\"\",Input!AX50)","v":""},{"$f":"IF(Input!V50=\"\",\"\",Input!V50)","v":""}]
["",{"$f":"IF( Input!B51=\"\",\"\",Input!B51)","v":""},{"$f":"IF( Input!C51=\"\",\"\",Input!C51)","v":""},{"$f":"IF( Input!E51=\"\",\"\",Input!E51)","v":""},{"$f":"IF( Input!F51=\"\",\"\",Input!F51)","v":""},{"$f":"IF( Input!G51=\"\",\"\",Input!G51)","v":""},{"$f":"IF( Input!F51=\"\",\"\",Input!F51*Input!Y51+Input!Z51)","v":""},{"$f":"IF( Input!H51=\"\",\"\",Input!H51)","v":""},{"$f":"IF( Input!I51=\"\",\"\",Input!I51)","v":""},{"$f":"IF( Input!AH51=\"\",\"\",Input!AH51)","v":""},{"$f":"IF( Input!AF51=\"\",\"\",Input!AF51)","v":""},{"$f":"IF( Input!L51=\"\",\"\",Input!L51)","v":""},{"$f":"IF( Input!N51=\"\",\"\",Input!N51)","v":""},{"$f":"IF( Input!O51=\"\",\"\",Input!O51)","v":""},{"$f":"IF( Input!P51=\"\",\"\",Input!P51)","v":""},{"$f":"IF( Input!O51=\"\",\"\",Input!O51*Input!AL51+Input!AM51)","v":""},{"$f":"IF( Input!Q51=\"\",\"\",Input!Q51)","v":""},{"$f":"IF( Input!R51=\"\",\"\",Input!R51)","v":""},{"$f":"IF( Input!AU51=\"\",\"\",Input!AU51)","v":""},{"$f":"IF( Input!AS51=\"\",\"\",Input!AS51)","v":""},{"$f":"IF( Input!BB51=\"\",\"\",Input!BB51)","v":""},{"$f":"IF(Input!AY51=\"\",\"\",Input!AY51)","v":""},{"$f":"IF(Input!AZ51=\"\",\"\",Input!AZ51)","v":""},null,{"$f":"IF(Input!AR51=\"\",\"\",Input!AR51)","v":""},{"$f":"IF(Input!B51=\"\",\"\",(Input!AN51*Input!AP51+Input!AO51*Input!AQ51)/SUM(Input!AN51:AO51))","v":""},{"$f":"IF(Input!K51=\"\",\"\",Input!K51)","v":""},{"$f":"IF(Input!A51=\"\",\"\",Input!A51)","v":""},{"$f":"IF(Input!AT51=\"\",\"\",Input!AT51)","v":""},{"$f":"IF(Input!BC51=\"\",\"\",Input!BC51)","v":""},{"$f":"IF(Input!BD51=\"\",\"\",Input!BD51)","v":""},{"$f":"IF(Input!BG51=\"\",\"\",Input!BG51)","v":""},{"$f":"IF(Input!AX51=\"\",\"\",Input!AX51)","v":""},{"$f":"IF(Input!V51=\"\",\"\",Input!V51)","v":""}]
["",{"$f":"IF( Input!B52=\"\",\"\",Input!B52)","v":""},{"$f":"IF( Input!C52=\"\",\"\",Input!C52)","v":""},{"$f":"IF( Input!E52=\"\",\"\",Input!E52)","v":""},{"$f":"IF( Input!F52=\"\",\"\",Input!F52)","v":""},{"$f":"IF( Input!G52=\"\",\"\",Input!G52)","v":""},{"$f":"IF( Input!F52=\"\",\"\",Input!F52*Input!Y52+Input!Z52)","v":""},{"$f":"IF( Input!H52=\"\",\"\",Input!H52)","v":""},{"$f":"IF( Input!I52=\"\",\"\",Input!I52)","v":""},{"$f":"IF( Input!AH52=\"\",\"\",Input!AH52)","v":""},{"$f":"IF( Input!AF52=\"\",\"\",Input!AF52)","v":""},{"$f":"IF( Input!L52=\"\",\"\",Input!L52)","v":""},{"$f":"IF( Input!N52=\"\",\"\",Input!N52)","v":""},{"$f":"IF( Input!O52=\"\",\"\",Input!O52)","v":""},{"$f":"IF( Input!P52=\"\",\"\",Input!P52)","v":""},{"$f":"IF( Input!O52=\"\",\"\",Input!O52*Input!AL52+Input!AM52)","v":""},{"$f":"IF( Input!Q52=\"\",\"\",Input!Q52)","v":""},{"$f":"IF( Input!R52=\"\",\"\",Input!R52)","v":""},{"$f":"IF( Input!AU52=\"\",\"\",Input!AU52)","v":""},{"$f":"IF( Input!AS52=\"\",\"\",Input!AS52)","v":""},{"$f":"IF( Input!BB52=\"\",\"\",Input!BB52)","v":""},{"$f":"IF(Input!AY52=\"\",\"\",Input!AY52)","v":""},{"$f":"IF(Input!AZ52=\"\",\"\",Input!AZ52)","v":""},null,{"$f":"IF(Input!AR52=\"\",\"\",Input!AR52)","v":""},{"$f":"IF(Input!B52=\"\",\"\",(Input!AN52*Input!AP52+Input!AO52*Input!AQ52)/SUM(Input!AN52:AO52))","v":""},{"$f":"IF(Input!K52=\"\",\"\",Input!K52)","v":""},{"$f":"IF(Input!A52=\"\",\"\",Input!A52)","v":""},{"$f":"IF(Input!AT52=\"\",\"\",Input!AT52)","v":""},{"$f":"IF(Input!BC52=\"\",\"\",Input!BC52)","v":""},{"$f":"IF(Input!BD52=\"\",\"\",Input!BD52)","v":""},{"$f":"IF(Input!BG52=\"\",\"\",Input!BG52)","v":""},{"$f":"IF(Input!AX52=\"\",\"\",Input!AX52)","v":""},{"$f":"IF(Input!V52=\"\",\"\",Input!V52)","v":""}]
["",{"$f":"IF( Input!B53=\"\",\"\",Input!B53)","v":""},{"$f":"IF( Input!C53=\"\",\"\",Input!C53)","v":""},{"$f":"IF( Input!E53=\"\",\"\",Input!E53)","v":""},{"$f":"IF( Input!F53=\"\",\"\",Input!F53)","v":""},{"$f":"IF( Input!G53=\"\",\"\",Input!G53)","v":""},{"$f":"IF( Input!F53=\"\",\"\",Input!F53*Input!Y53+Input!Z53)","v":""},{"$f":"IF( Input!H53=\"\",\"\",Input!H53)","v":""},{"$f":"IF( Input!I53=\"\",\"\",Input!I53)","v":""},{"$f":"IF( Input!AH53=\"\",\"\",Input!AH53)","v":""},{"$f":"IF( Input!AF53=\"\",\"\",Input!AF53)","v":""},{"$f":"IF( Input!L53=\"\",\"\",Input!L53)","v":""},{"$f":"IF( Input!N53=\"\",\"\",Input!N53)","v":""},{"$f":"IF( Input!O53=\"\",\"\",Input!O53)","v":""},{"$f":"IF( Input!P53=\"\",\"\",Input!P53)","v":""},{"$f":"IF( Input!O53=\"\",\"\",Input!O53*Input!AL53+Input!AM53)","v":""},{"$f":"IF( Input!Q53=\"\",\"\",Input!Q53)","v":""},{"$f":"IF( Input!R53=\"\",\"\",Input!R53)","v":""},{"$f":"IF( Input!AU53=\"\",\"\",Input!AU53)","v":""},{"$f":"IF( Input!AS53=\"\",\"\",Input!AS53)","v":""},{"$f":"IF( Input!BB53=\"\",\"\",Input!BB53)","v":""},{"$f":"IF(Input!AY53=\"\",\"\",Input!AY53)","v":""},{"$f":"IF(Input!AZ53=\"\",\"\",Input!AZ53)","v":""},null,{"$f":"IF(Input!AR53=\"\",\"\",Input!AR53)","v":""},{"$f":"IF(Input!B53=\"\",\"\",(Input!AN53*Input!AP53+Input!AO53*Input!AQ53)/SUM(Input!AN53:AO53))","v":""},{"$f":"IF(Input!K53=\"\",\"\",Input!K53)","v":""},{"$f":"IF(Input!A53=\"\",\"\",Input!A53)","v":""},{"$f":"IF(Input!AT53=\"\",\"\",Input!AT53)","v":""},{"$f":"IF(Input!BC53=\"\",\"\",Input!BC53)","v":""},{"$f":"IF(Input!BD53=\"\",\"\",Input!BD53)","v":""},{"$f":"IF(Input!BG53=\"\",\"\",Input!BG53)","v":""},{"$f":"IF(Input!AX53=\"\",\"\",Input!AX53)","v":""},{"$f":"IF(Input!V53=\"\",\"\",Input!V53)","v":""}]
["",{"$f":"IF( Input!B54=\"\",\"\",Input!B54)","v":""},{"$f":"IF( Input!C54=\"\",\"\",Input!C54)","v":""},{"$f":"IF( Input!E54=\"\",\"\",Input!E54)","v":""},{"$f":"IF( Input!F54=\"\",\"\",Input!F54)","v":""},{"$f":"IF( Input!G54=\"\",\"\",Input!G54)","v":""},{"$f":"IF( Input!F54=\"\",\"\",Input!F54*Input!Y54+Input!Z54)","v":""},{"$f":"IF( Input!H54=\"\",\"\",Input!H54)","v":""},{"$f":"IF( Input!I54=\"\",\"\",Input!I54)","v":""},{"$f":"IF( Input!AH54=\"\",\"\",Input!AH54)","v":""},{"$f":"IF( Input!AF54=\"\",\"\",Input!AF54)","v":""},{"$f":"IF( Input!L54=\"\",\"\",Input!L54)","v":""},{"$f":"IF( Input!N54=\"\",\"\",Input!N54)","v":""},{"$f":"IF( Input!O54=\"\",\"\",Input!O54)","v":""},{"$f":"IF( Input!P54=\"\",\"\",Input!P54)","v":""},{"$f":"IF( Input!O54=\"\",\"\",Input!O54*Input!AL54+Input!AM54)","v":""},{"$f":"IF( Input!Q54=\"\",\"\",Input!Q54)","v":""},{"$f":"IF( Input!R54=\"\",\"\",Input!R54)","v":""},{"$f":"IF( Input!AU54=\"\",\"\",Input!AU54)","v":""},{"$f":"IF( Input!AS54=\"\",\"\",Input!AS54)","v":""},{"$f":"IF( Input!BB54=\"\",\"\",Input!BB54)","v":""},{"$f":"IF(Input!AY54=\"\",\"\",Input!AY54)","v":""},{"$f":"IF(Input!AZ54=\"\",\"\",Input!AZ54)","v":""},null,{"$f":"IF(Input!AR54=\"\",\"\",Input!AR54)","v":""},{"$f":"IF(Input!B54=\"\",\"\",(Input!AN54*Input!AP54+Input!AO54*Input!AQ54)/SUM(Input!AN54:AO54))","v":""},{"$f":"IF(Input!K54=\"\",\"\",Input!K54)","v":""},{"$f":"IF(Input!A54=\"\",\"\",Input!A54)","v":""},{"$f":"IF(Input!AT54=\"\",\"\",Input!AT54)","v":""},{"$f":"IF(Input!BC54=\"\",\"\",Input!BC54)","v":""},{"$f":"IF(Input!BD54=\"\",\"\",Input!BD54)","v":""},{"$f":"IF(Input!BG54=\"\",\"\",Input!BG54)","v":""},{"$f":"IF(Input!AX54=\"\",\"\",Input!AX54)","v":""},{"$f":"IF(Input!V54=\"\",\"\",Input!V54)","v":""}]
["",{"$f":"IF( Input!B55=\"\",\"\",Input!B55)","v":""},{"$f":"IF( Input!C55=\"\",\"\",Input!C55)","v":""},{"$f":"IF( Input!E55=\"\",\"\",Input!E55)","v":""},{"$f":"IF( Input!F55=\"\",\"\",Input!F55)","v":""},{"$f":"IF( Input!G55=\"\",\"\",Input!G55)","v":""},{"$f":"IF( Input!F55=\"\",\"\",Input!F55*Input!Y55+Input!Z55)","v":""},{"$f":"IF( Input!H55=\"\",\"\",Input!H55)","v":""},{"$f":"IF( Input!I55=\"\",\"\",Input!I55)","v":""},{"$f":"IF( Input!AH55=\"\",\"\",Input!AH55)","v":""},{"$f":"IF( Input!AF55=\"\",\"\",Input!AF55)","v":""},{"$f":"IF( Input!L55=\"\",\"\",Input!L55)","v":""},{"$f":"IF( Input!N55=\"\",\"\",Input!N55)","v":""},{"$f":"IF( Input!O55=\"\",\"\",Input!O55)","v":""},{"$f":"IF( Input!P55=\"\",\"\",Input!P55)","v":""},{"$f":"IF( Input!O55=\"\",\"\",Input!O55*Input!AL55+Input!AM55)","v":""},{"$f":"IF( Input!Q55=\"\",\"\",Input!Q55)","v":""},{"$f":"IF( Input!R55=\"\",\"\",Input!R55)","v":""},{"$f":"IF( Input!AU55=\"\",\"\",Input!AU55)","v":""},{"$f":"IF( Input!AS55=\"\",\"\",Input!AS55)","v":""},{"$f":"IF( Input!BB55=\"\",\"\",Input!BB55)","v":""},{"$f":"IF(Input!AY55=\"\",\"\",Input!AY55)","v":""},{"$f":"IF(Input!AZ55=\"\",\"\",Input!AZ55)","v":""},null,{"$f":"IF(Input!AR55=\"\",\"\",Input!AR55)","v":""},{"$f":"IF(Input!B55=\"\",\"\",(Input!AN55*Input!AP55+Input!AO55*Input!AQ55)/SUM(Input!AN55:AO55))","v":""},{"$f":"IF(Input!K55=\"\",\"\",Input!K55)","v":""},{"$f":"IF(Input!A55=\"\",\"\",Input!A55)","v":""},{"$f":"IF(Input!AT55=\"\",\"\",Input!AT55)","v":""},{"$f":"IF(Input!BC55=\"\",\"\",Input!BC55)","v":""},{"$f":"IF(Input!BD55=\"\",\"\",Input!BD55)","v":""},{"$f":"IF(Input!BG55=\"\",\"\",Input!BG55)","v":""},{"$f":"IF(Input!AX55=\"\",\"\",Input!AX55)","v":""},{"$f":"IF(Input!V55=\"\",\"\",Input!V55)","v":""}]
["",{"$f":"IF( Input!B56=\"\",\"\",Input!B56)","v":""},{"$f":"IF( Input!C56=\"\",\"\",Input!C56)","v":""},{"$f":"IF( Input!E56=\"\",\"\",Input!E56)","v":""},{"$f":"IF( Input!F56=\"\",\"\",Input!F56)","v":""},{"$f":"IF( Input!G56=\"\",\"\",Input!G56)","v":""},{"$f":"IF( Input!F56=\"\",\"\",Input!F56*Input!Y56+Input!Z56)","v":""},{"$f":"IF( Input!H56=\"\",\"\",Input!H56)","v":""},{"$f":"IF( Input!I56=\"\",\"\",Input!I56)","v":""},{"$f":"IF( Input!AH56=\"\",\"\",Input!AH56)","v":""},{"$f":"IF( Input!AF56=\"\",\"\",Input!AF56)","v":""},{"$f":"IF( Input!L56=\"\",\"\",Input!L56)","v":""},{"$f":"IF( Input!N56=\"\",\"\",Input!N56)","v":""},{"$f":"IF( Input!O56=\"\",\"\",Input!O56)","v":""},{"$f":"IF( Input!P56=\"\",\"\",Input!P56)","v":""},{"$f":"IF( Input!O56=\"\",\"\",Input!O56*Input!AL56+Input!AM56)","v":""},{"$f":"IF( Input!Q56=\"\",\"\",Input!Q56)","v":""},{"$f":"IF( Input!R56=\"\",\"\",Input!R56)","v":""},{"$f":"IF( Input!AU56=\"\",\"\",Input!AU56)","v":""},{"$f":"IF( Input!AS56=\"\",\"\",Input!AS56)","v":""},{"$f":"IF( Input!BB56=\"\",\"\",Input!BB56)","v":""},{"$f":"IF(Input!AY56=\"\",\"\",Input!AY56)","v":""},{"$f":"IF(Input!AZ56=\"\",\"\",Input!AZ56)","v":""},null,{"$f":"IF(Input!AR56=\"\",\"\",Input!AR56)","v":""},{"$f":"IF(Input!B56=\"\",\"\",(Input!AN56*Input!AP56+Input!AO56*Input!AQ56)/SUM(Input!AN56:AO56))","v":""},{"$f":"IF(Input!K56=\"\",\"\",Input!K56)","v":""},{"$f":"IF(Input!A56=\"\",\"\",Input!A56)","v":""},{"$f":"IF(Input!AT56=\"\",\"\",Input!AT56)","v":""},{"$f":"IF(Input!BC56=\"\",\"\",Input!BC56)","v":""},{"$f":"IF(Input!BD56=\"\",\"\",Input!BD56)","v":""},{"$f":"IF(Input!BG56=\"\",\"\",Input!BG56)","v":""},{"$f":"IF(Input!AX56=\"\",\"\",Input!AX56)","v":""},{"$f":"IF(Input!V56=\"\",\"\",Input!V56)","v":""}]
["",{"$f":"IF( Input!B57=\"\",\"\",Input!B57)","v":""},{"$f":"IF( Input!C57=\"\",\"\",Input!C57)","v":""},{"$f":"IF( Input!E57=\"\",\"\",Input!E57)","v":""},{"$f":"IF( Input!F57=\"\",\"\",Input!F57)","v":""},{"$f":"IF( Input!G57=\"\",\"\",Input!G57)","v":""},{"$f":"IF( Input!F57=\"\",\"\",Input!F57*Input!Y57+Input!Z57)","v":""},{"$f":"IF( Input!H57=\"\",\"\",Input!H57)","v":""},{"$f":"IF( Input!I57=\"\",\"\",Input!I57)","v":""},{"$f":"IF( Input!AH57=\"\",\"\",Input!AH57)","v":""},{"$f":"IF( Input!AF57=\"\",\"\",Input!AF57)","v":""},{"$f":"IF( Input!L57=\"\",\"\",Input!L57)","v":""},{"$f":"IF( Input!N57=\"\",\"\",Input!N57)","v":""},{"$f":"IF( Input!O57=\"\",\"\",Input!O57)","v":""},{"$f":"IF( Input!P57=\"\",\"\",Input!P57)","v":""},{"$f":"IF( Input!O57=\"\",\"\",Input!O57*Input!AL57+Input!AM57)","v":""},{"$f":"IF( Input!Q57=\"\",\"\",Input!Q57)","v":""},{"$f":"IF( Input!R57=\"\",\"\",Input!R57)","v":""},{"$f":"IF( Input!AU57=\"\",\"\",Input!AU57)","v":""},{"$f":"IF( Input!AS57=\"\",\"\",Input!AS57)","v":""},{"$f":"IF( Input!BB57=\"\",\"\",Input!BB57)","v":""},{"$f":"IF(Input!AY57=\"\",\"\",Input!AY57)","v":""},{"$f":"IF(Input!AZ57=\"\",\"\",Input!AZ57)","v":""},null,{"$f":"IF(Input!AR57=\"\",\"\",Input!AR57)","v":""},{"$f":"IF(Input!B57=\"\",\"\",(Input!AN57*Input!AP57+Input!AO57*Input!AQ57)/SUM(Input!AN57:AO57))","v":""},{"$f":"IF(Input!K57=\"\",\"\",Input!K57)","v":""},{"$f":"IF(Input!A57=\"\",\"\",Input!A57)","v":""},{"$f":"IF(Input!AT57=\"\",\"\",Input!AT57)","v":""},{"$f":"IF(Input!BC57=\"\",\"\",Input!BC57)","v":""},{"$f":"IF(Input!BD57=\"\",\"\",Input!BD57)","v":""},{"$f":"IF(Input!BG57=\"\",\"\",Input!BG57)","v":""},{"$f":"IF(Input!AX57=\"\",\"\",Input!AX57)","v":""},{"$f":"IF(Input!V57=\"\",\"\",Input!V57)","v":""}]
["",{"$f":"IF( Input!B58=\"\",\"\",Input!B58)","v":""},{"$f":"IF( Input!C58=\"\",\"\",Input!C58)","v":""},{"$f":"IF( Input!E58=\"\",\"\",Input!E58)","v":""},{"$f":"IF( Input!F58=\"\",\"\",Input!F58)","v":""},{"$f":"IF( Input!G58=\"\",\"\",Input!G58)","v":""},{"$f":"IF( Input!F58=\"\",\"\",Input!F58*Input!Y58+Input!Z58)","v":""},{"$f":"IF( Input!H58=\"\",\"\",Input!H58)","v":""},{"$f":"IF( Input!I58=\"\",\"\",Input!I58)","v":""},{"$f":"IF( Input!AH58=\"\",\"\",Input!AH58)","v":""},{"$f":"IF( Input!AF58=\"\",\"\",Input!AF58)","v":""},{"$f":"IF( Input!L58=\"\",\"\",Input!L58)","v":""},{"$f":"IF( Input!N58=\"\",\"\",Input!N58)","v":""},{"$f":"IF( Input!O58=\"\",\"\",Input!O58)","v":""},{"$f":"IF( Input!P58=\"\",\"\",Input!P58)","v":""},{"$f":"IF( Input!O58=\"\",\"\",Input!O58*Input!AL58+Input!AM58)","v":""},{"$f":"IF( Input!Q58=\"\",\"\",Input!Q58)","v":""},{"$f":"IF( Input!R58=\"\",\"\",Input!R58)","v":""},{"$f":"IF( Input!AU58=\"\",\"\",Input!AU58)","v":""},{"$f":"IF( Input!AS58=\"\",\"\",Input!AS58)","v":""},{"$f":"IF( Input!BB58=\"\",\"\",Input!BB58)","v":""},{"$f":"IF(Input!AY58=\"\",\"\",Input!AY58)","v":""},{"$f":"IF(Input!AZ58=\"\",\"\",Input!AZ58)","v":""},null,{"$f":"IF(Input!AR58=\"\",\"\",Input!AR58)","v":""},{"$f":"IF(Input!B58=\"\",\"\",(Input!AN58*Input!AP58+Input!AO58*Input!AQ58)/SUM(Input!AN58:AO58))","v":""},{"$f":"IF(Input!K58=\"\",\"\",Input!K58)","v":""},{"$f":"IF(Input!A58=\"\",\"\",Input!A58)","v":""},{"$f":"IF(Input!AT58=\"\",\"\",Input!AT58)","v":""},{"$f":"IF(Input!BC58=\"\",\"\",Input!BC58)","v":""},{"$f":"IF(Input!BD58=\"\",\"\",Input!BD58)","v":""},{"$f":"IF(Input!BG58=\"\",\"\",Input!BG58)","v":""},{"$f":"IF(Input!AX58=\"\",\"\",Input!AX58)","v":""},{"$f":"IF(Input!V58=\"\",\"\",Input!V58)","v":""}]
["",{"$f":"IF( Input!B59=\"\",\"\",Input!B59)","v":""},{"$f":"IF( Input!C59=\"\",\"\",Input!C59)","v":""},{"$f":"IF( Input!E59=\"\",\"\",Input!E59)","v":""},{"$f":"IF( Input!F59=\"\",\"\",Input!F59)","v":""},{"$f":"IF( Input!G59=\"\",\"\",Input!G59)","v":""},{"$f":"IF( Input!F59=\"\",\"\",Input!F59*Input!Y59+Input!Z59)","v":""},{"$f":"IF( Input!H59=\"\",\"\",Input!H59)","v":""},{"$f":"IF( Input!I59=\"\",\"\",Input!I59)","v":""},{"$f":"IF( Input!AH59=\"\",\"\",Input!AH59)","v":""},{"$f":"IF( Input!AF59=\"\",\"\",Input!AF59)","v":""},{"$f":"IF( Input!L59=\"\",\"\",Input!L59)","v":""},{"$f":"IF( Input!N59=\"\",\"\",Input!N59)","v":""},{"$f":"IF( Input!O59=\"\",\"\",Input!O59)","v":""},{"$f":"IF( Input!P59=\"\",\"\",Input!P59)","v":""},{"$f":"IF( Input!O59=\"\",\"\",Input!O59*Input!AL59+Input!AM59)","v":""},{"$f":"IF( Input!Q59=\"\",\"\",Input!Q59)","v":""},{"$f":"IF( Input!R59=\"\",\"\",Input!R59)","v":""},{"$f":"IF( Input!AU59=\"\",\"\",Input!AU59)","v":""},{"$f":"IF( Input!AS59=\"\",\"\",Input!AS59)","v":""},{"$f":"IF( Input!BB59=\"\",\"\",Input!BB59)","v":""},{"$f":"IF(Input!AY59=\"\",\"\",Input!AY59)","v":""},{"$f":"IF(Input!AZ59=\"\",\"\",Input!AZ59)","v":""},null,{"$f":"IF(Input!AR59=\"\",\"\",Input!AR59)","v":""},{"$f":"IF(Input!B59=\"\",\"\",(Input!AN59*Input!AP59+Input!AO59*Input!AQ59)/SUM(Input!AN59:AO59))","v":""},{"$f":"IF(Input!K59=\"\",\"\",Input!K59)","v":""},{"$f":"IF(Input!A59=\"\",\"\",Input!A59)","v":""},{"$f":"IF(Input!AT59=\"\",\"\",Input!AT59)","v":""},{"$f":"IF(Input!BC59=\"\",\"\",Input!BC59)","v":""},{"$f":"IF(Input!BD59=\"\",\"\",Input!BD59)","v":""},{"$f":"IF(Input!BG59=\"\",\"\",Input!BG59)","v":""},{"$f":"IF(Input!AX59=\"\",\"\",Input!AX59)","v":""},{"$f":"IF(Input!V59=\"\",\"\",Input!V59)","v":""}]
["",{"$f":"IF( Input!B60=\"\",\"\",Input!B60)","v":""},{"$f":"IF( Input!C60=\"\",\"\",Input!C60)","v":""},{"$f":"IF( Input!E60=\"\",\"\",Input!E60)","v":""},{"$f":"IF( Input!F60=\"\",\"\",Input!F60)","v":""},{"$f":"IF( Input!G60=\"\",\"\",Input!G60)","v":""},{"$f":"IF( Input!F60=\"\",\"\",Input!F60*Input!Y60+Input!Z60)","v":""},{"$f":"IF( Input!H60=\"\",\"\",Input!H60)","v":""},{"$f":"IF( Input!I60=\"\",\"\",Input!I60)","v":""},{"$f":"IF( Input!AH60=\"\",\"\",Input!AH60)","v":""},{"$f":"IF( Input!AF60=\"\",\"\",Input!AF60)","v":""},{"$f":"IF( Input!L60=\"\",\"\",Input!L60)","v":""},{"$f":"IF( Input!N60=\"\",\"\",Input!N60)","v":""},{"$f":"IF( Input!O60=\"\",\"\",Input!O60)","v":""},{"$f":"IF( Input!P60=\"\",\"\",Input!P60)","v":""},{"$f":"IF( Input!O60=\"\",\"\",Input!O60*Input!AL60+Input!AM60)","v":""},{"$f":"IF( Input!Q60=\"\",\"\",Input!Q60)","v":""},{"$f":"IF( Input!R60=\"\",\"\",Input!R60)","v":""},{"$f":"IF( Input!AU60=\"\",\"\",Input!AU60)","v":""},{"$f":"IF( Input!AS60=\"\",\"\",Input!AS60)","v":""},{"$f":"IF( Input!BB60=\"\",\"\",Input!BB60)","v":""},{"$f":"IF(Input!AY60=\"\",\"\",Input!AY60)","v":""},{"$f":"IF(Input!AZ60=\"\",\"\",Input!AZ60)","v":""},null,{"$f":"IF(Input!AR60=\"\",\"\",Input!AR60)","v":""},{"$f":"IF(Input!B60=\"\",\"\",(Input!AN60*Input!AP60+Input!AO60*Input!AQ60)/SUM(Input!AN60:AO60))","v":""},{"$f":"IF(Input!K60=\"\",\"\",Input!K60)","v":""},{"$f":"IF(Input!A60=\"\",\"\",Input!A60)","v":""},{"$f":"IF(Input!AT60=\"\",\"\",Input!AT60)","v":""},{"$f":"IF(Input!BC60=\"\",\"\",Input!BC60)","v":""},{"$f":"IF(Input!BD60=\"\",\"\",Input!BD60)","v":""},{"$f":"IF(Input!BG60=\"\",\"\",Input!BG60)","v":""},{"$f":"IF(Input!AX60=\"\",\"\",Input!AX60)","v":""},{"$f":"IF(Input!V60=\"\",\"\",Input!V60)","v":""}]
["",{"$f":"IF( Input!B61=\"\",\"\",Input!B61)","v":""},{"$f":"IF( Input!C61=\"\",\"\",Input!C61)","v":""},{"$f":"IF( Input!E61=\"\",\"\",Input!E61)","v":""},{"$f":"IF( Input!F61=\"\",\"\",Input!F61)","v":""},{"$f":"IF( Input!G61=\"\",\"\",Input!G61)","v":""},{"$f":"IF( Input!F61=\"\",\"\",Input!F61*Input!Y61+Input!Z61)","v":""},{"$f":"IF( Input!H61=\"\",\"\",Input!H61)","v":""},{"$f":"IF( Input!I61=\"\",\"\",Input!I61)","v":""},{"$f":"IF( Input!AH61=\"\",\"\",Input!AH61)","v":""},{"$f":"IF( Input!AF61=\"\",\"\",Input!AF61)","v":""},{"$f":"IF( Input!L61=\"\",\"\",Input!L61)","v":""},{"$f":"IF( Input!N61=\"\",\"\",Input!N61)","v":""},{"$f":"IF( Input!O61=\"\",\"\",Input!O61)","v":""},{"$f":"IF( Input!P61=\"\",\"\",Input!P61)","v":""},{"$f":"IF( Input!O61=\"\",\"\",Input!O61*Input!AL61+Input!AM61)","v":""},{"$f":"IF( Input!Q61=\"\",\"\",Input!Q61)","v":""},{"$f":"IF( Input!R61=\"\",\"\",Input!R61)","v":""},{"$f":"IF( Input!AU61=\"\",\"\",Input!AU61)","v":""},{"$f":"IF( Input!AS61=\"\",\"\",Input!AS61)","v":""},{"$f":"IF( Input!BB61=\"\",\"\",Input!BB61)","v":""},{"$f":"IF(Input!AY61=\"\",\"\",Input!AY61)","v":""},{"$f":"IF(Input!AZ61=\"\",\"\",Input!AZ61)","v":""},null,{"$f":"IF(Input!AR61=\"\",\"\",Input!AR61)","v":""},{"$f":"IF(Input!B61=\"\",\"\",(Input!AN61*Input!AP61+Input!AO61*Input!AQ61)/SUM(Input!AN61:AO61))","v":""},{"$f":"IF(Input!K61=\"\",\"\",Input!K61)","v":""},{"$f":"IF(Input!A61=\"\",\"\",Input!A61)","v":""},{"$f":"IF(Input!AT61=\"\",\"\",Input!AT61)","v":""},{"$f":"IF(Input!BC61=\"\",\"\",Input!BC61)","v":""},{"$f":"IF(Input!BD61=\"\",\"\",Input!BD61)","v":""},{"$f":"IF(Input!BG61=\"\",\"\",Input!BG61)","v":""},{"$f":"IF(Input!AX61=\"\",\"\",Input!AX61)","v":""},{"$f":"IF(Input!V61=\"\",\"\",Input!V61)","v":""}]
["",{"$f":"IF( Input!B62=\"\",\"\",Input!B62)","v":""},{"$f":"IF( Input!C62=\"\",\"\",Input!C62)","v":""},{"$f":"IF( Input!E62=\"\",\"\",Input!E62)","v":""},{"$f":"IF( Input!F62=\"\",\"\",Input!F62)","v":""},{"$f":"IF( Input!G62=\"\",\"\",Input!G62)","v":""},{"$f":"IF( Input!F62=\"\",\"\",Input!F62*Input!Y62+Input!Z62)","v":""},{"$f":"IF( Input!H62=\"\",\"\",Input!H62)","v":""},{"$f":"IF( Input!I62=\"\",\"\",Input!I62)","v":""},{"$f":"IF( Input!AH62=\"\",\"\",Input!AH62)","v":""},{"$f":"IF( Input!AF62=\"\",\"\",Input!AF62)","v":""},{"$f":"IF( Input!L62=\"\",\"\",Input!L62)","v":""},{"$f":"IF( Input!N62=\"\",\"\",Input!N62)","v":""},{"$f":"IF( Input!O62=\"\",\"\",Input!O62)","v":""},{"$f":"IF( Input!P62=\"\",\"\",Input!P62)","v":""},{"$f":"IF( Input!O62=\"\",\"\",Input!O62*Input!AL62+Input!AM62)","v":""},{"$f":"IF( Input!Q62=\"\",\"\",Input!Q62)","v":""},{"$f":"IF( Input!R62=\"\",\"\",Input!R62)","v":""},{"$f":"IF( Input!AU62=\"\",\"\",Input!AU62)","v":""},{"$f":"IF( Input!AS62=\"\",\"\",Input!AS62)","v":""},{"$f":"IF( Input!BB62=\"\",\"\",Input!BB62)","v":""},{"$f":"IF(Input!AY62=\"\",\"\",Input!AY62)","v":""},{"$f":"IF(Input!AZ62=\"\",\"\",Input!AZ62)","v":""},null,{"$f":"IF(Input!AR62=\"\",\"\",Input!AR62)","v":""},{"$f":"IF(Input!B62=\"\",\"\",(Input!AN62*Input!AP62+Input!AO62*Input!AQ62)/SUM(Input!AN62:AO62))","v":""},{"$f":"IF(Input!K62=\"\",\"\",Input!K62)","v":""},{"$f":"IF(Input!A62=\"\",\"\",Input!A62)","v":""},{"$f":"IF(Input!AT62=\"\",\"\",Input!AT62)","v":""},{"$f":"IF(Input!BC62=\"\",\"\",Input!BC62)","v":""},{"$f":"IF(Input!BD62=\"\",\"\",Input!BD62)","v":""},{"$f":"IF(Input!BG62=\"\",\"\",Input!BG62)","v":""},{"$f":"IF(Input!AX62=\"\",\"\",Input!AX62)","v":""},{"$f":"IF(Input!V62=\"\",\"\",Input!V62)","v":""}]
["",{"$f":"IF( Input!B63=\"\",\"\",Input!B63)","v":""},{"$f":"IF( Input!C63=\"\",\"\",Input!C63)","v":""},{"$f":"IF( Input!E63=\"\",\"\",Input!E63)","v":""},{"$f":"IF( Input!F63=\"\",\"\",Input!F63)","v":""},{"$f":"IF( Input!G63=\"\",\"\",Input!G63)","v":""},{"$f":"IF( Input!F63=\"\",\"\",Input!F63*Input!Y63+Input!Z63)","v":""},{"$f":"IF( Input!H63=\"\",\"\",Input!H63)","v":""},{"$f":"IF( Input!I63=\"\",\"\",Input!I63)","v":""},{"$f":"IF( Input!AH63=\"\",\"\",Input!AH63)","v":""},{"$f":"IF( Input!AF63=\"\",\"\",Input!AF63)","v":""},{"$f":"IF( Input!L63=\"\",\"\",Input!L63)","v":""},{"$f":"IF( Input!N63=\"\",\"\",Input!N63)","v":""},{"$f":"IF( Input!O63=\"\",\"\",Input!O63)","v":""},{"$f":"IF( Input!P63=\"\",\"\",Input!P63)","v":""},{"$f":"IF( Input!O63=\"\",\"\",Input!O63*Input!AL63+Input!AM63)","v":""},{"$f":"IF( Input!Q63=\"\",\"\",Input!Q63)","v":""},{"$f":"IF( Input!R63=\"\",\"\",Input!R63)","v":""},{"$f":"IF( Input!AU63=\"\",\"\",Input!AU63)","v":""},{"$f":"IF( Input!AS63=\"\",\"\",Input!AS63)","v":""},{"$f":"IF( Input!BB63=\"\",\"\",Input!BB63)","v":""},{"$f":"IF(Input!AY63=\"\",\"\",Input!AY63)","v":""},{"$f":"IF(Input!AZ63=\"\",\"\",Input!AZ63)","v":""},null,{"$f":"IF(Input!AR63=\"\",\"\",Input!AR63)","v":""},{"$f":"IF(Input!B63=\"\",\"\",(Input!AN63*Input!AP63+Input!AO63*Input!AQ63)/SUM(Input!AN63:AO63))","v":""},{"$f":"IF(Input!K63=\"\",\"\",Input!K63)","v":""},{"$f":"IF(Input!A63=\"\",\"\",Input!A63)","v":""},{"$f":"IF(Input!AT63=\"\",\"\",Input!AT63)","v":""},{"$f":"IF(Input!BC63=\"\",\"\",Input!BC63)","v":""},{"$f":"IF(Input!BD63=\"\",\"\",Input!BD63)","v":""},{"$f":"IF(Input!BG63=\"\",\"\",Input!BG63)","v":""},{"$f":"IF(Input!AX63=\"\",\"\",Input!AX63)","v":""},{"$f":"IF(Input!V63=\"\",\"\",Input!V63)","v":""}]
["",{"$f":"IF( Input!B64=\"\",\"\",Input!B64)","v":""},{"$f":"IF( Input!C64=\"\",\"\",Input!C64)","v":""},{"$f":"IF( Input!E64=\"\",\"\",Input!E64)","v":""},{"$f":"IF( Input!F64=\"\",\"\",Input!F64)","v":""},{"$f":"IF( Input!G64=\"\",\"\",Input!G64)","v":""},{"$f":"IF( Input!F64=\"\",\"\",Input!F64*Input!Y64+Input!Z64)","v":""},{"$f":"IF( Input!H64=\"\",\"\",Input!H64)","v":""},{"$f":"IF( Input!I64=\"\",\"\",Input!I64)","v":""},{"$f":"IF( Input!AH64=\"\",\"\",Input!AH64)","v":""},{"$f":"IF( Input!AF64=\"\",\"\",Input!AF64)","v":""},{"$f":"IF( Input!L64=\"\",\"\",Input!L64)","v":""},{"$f":"IF( Input!N64=\"\",\"\",Input!N64)","v":""},{"$f":"IF( Input!O64=\"\",\"\",Input!O64)","v":""},{"$f":"IF( Input!P64=\"\",\"\",Input!P64)","v":""},{"$f":"IF( Input!O64=\"\",\"\",Input!O64*Input!AL64+Input!AM64)","v":""},{"$f":"IF( Input!Q64=\"\",\"\",Input!Q64)","v":""},{"$f":"IF( Input!R64=\"\",\"\",Input!R64)","v":""},{"$f":"IF( Input!AU64=\"\",\"\",Input!AU64)","v":""},{"$f":"IF( Input!AS64=\"\",\"\",Input!AS64)","v":""},{"$f":"IF( Input!BB64=\"\",\"\",Input!BB64)","v":""},{"$f":"IF(Input!AY64=\"\",\"\",Input!AY64)","v":""},{"$f":"IF(Input!AZ64=\"\",\"\",Input!AZ64)","v":""},null,{"$f":"IF(Input!AR64=\"\",\"\",Input!AR64)","v":""},{"$f":"IF(Input!B64=\"\",\"\",(Input!AN64*Input!AP64+Input!AO64*Input!AQ64)/SUM(Input!AN64:AO64))","v":""},{"$f":"IF(Input!K64=\"\",\"\",Input!K64)","v":""},{"$f":"IF(Input!A64=\"\",\"\",Input!A64)","v":""},{"$f":"IF(Input!AT64=\"\",\"\",Input!AT64)","v":""},{"$f":"IF(Input!BC64=\"\",\"\",Input!BC64)","v":""},{"$f":"IF(Input!BD64=\"\",\"\",Input!BD64)","v":""},{"$f":"IF(Input!BG64=\"\",\"\",Input!BG64)","v":""},{"$f":"IF(Input!AX64=\"\",\"\",Input!AX64)","v":""},{"$f":"IF(Input!V64=\"\",\"\",Input!V64)","v":""}]
["",{"$f":"IF( Input!B65=\"\",\"\",Input!B65)","v":""},{"$f":"IF( Input!C65=\"\",\"\",Input!C65)","v":""},{"$f":"IF( Input!E65=\"\",\"\",Input!E65)","v":""},{"$f":"IF( Input!F65=\"\",\"\",Input!F65)","v":""},{"$f":"IF( Input!G65=\"\",\"\",Input!G65)","v":""},{"$f":"IF( Input!F65=\"\",\"\",Input!F65*Input!Y65+Input!Z65)","v":""},{"$f":"IF( Input!H65=\"\",\"\",Input!H65)","v":""},{"$f":"IF( Input!I65=\"\",\"\",Input!I65)","v":""},{"$f":"IF( Input!AH65=\"\",\"\",Input!AH65)","v":""},{"$f":"IF( Input!AF65=\"\",\"\",Input!AF65)","v":""},{"$f":"IF( Input!L65=\"\",\"\",Input!L65)","v":""},{"$f":"IF( Input!N65=\"\",\"\",Input!N65)","v":""},{"$f":"IF( Input!O65=\"\",\"\",Input!O65)","v":""},{"$f":"IF( Input!P65=\"\",\"\",Input!P65)","v":""},{"$f":"IF( Input!O65=\"\",\"\",Input!O65*Input!AL65+Input!AM65)","v":""},{"$f":"IF( Input!Q65=\"\",\"\",Input!Q65)","v":""},{"$f":"IF( Input!R65=\"\",\"\",Input!R65)","v":""},{"$f":"IF( Input!AU65=\"\",\"\",Input!AU65)","v":""},{"$f":"IF( Input!AS65=\"\",\"\",Input!AS65)","v":""},{"$f":"IF( Input!BB65=\"\",\"\",Input!BB65)","v":""},{"$f":"IF(Input!AY65=\"\",\"\",Input!AY65)","v":""},{"$f":"IF(Input!AZ65=\"\",\"\",Input!AZ65)","v":""},null,{"$f":"IF(Input!AR65=\"\",\"\",Input!AR65)","v":""},{"$f":"IF(Input!B65=\"\",\"\",(Input!AN65*Input!AP65+Input!AO65*Input!AQ65)/SUM(Input!AN65:AO65))","v":""},{"$f":"IF(Input!K65=\"\",\"\",Input!K65)","v":""},{"$f":"IF(Input!A65=\"\",\"\",Input!A65)","v":""},{"$f":"IF(Input!AT65=\"\",\"\",Input!AT65)","v":""},{"$f":"IF(Input!BC65=\"\",\"\",Input!BC65)","v":""},{"$f":"IF(Input!BD65=\"\",\"\",Input!BD65)","v":""},{"$f":"IF(Input!BG65=\"\",\"\",Input!BG65)","v":""},{"$f":"IF(Input!AX65=\"\",\"\",Input!AX65)","v":""},{"$f":"IF(Input!V65=\"\",\"\",Input!V65)","v":""}]
["",{"$f":"IF( Input!B66=\"\",\"\",Input!B66)","v":""},{"$f":"IF( Input!C66=\"\",\"\",Input!C66)","v":""},{"$f":"IF( Input!E66=\"\",\"\",Input!E66)","v":""},{"$f":"IF( Input!F66=\"\",\"\",Input!F66)","v":""},{"$f":"IF( Input!G66=\"\",\"\",Input!G66)","v":""},{"$f":"IF( Input!F66=\"\",\"\",Input!F66*Input!Y66+Input!Z66)","v":""},{"$f":"IF( Input!H66=\"\",\"\",Input!H66)","v":""},{"$f":"IF( Input!I66=\"\",\"\",Input!I66)","v":""},{"$f":"IF( Input!AH66=\"\",\"\",Input!AH66)","v":""},{"$f":"IF( Input!AF66=\"\",\"\",Input!AF66)","v":""},{"$f":"IF( Input!L66=\"\",\"\",Input!L66)","v":""},{"$f":"IF( Input!N66=\"\",\"\",Input!N66)","v":""},{"$f":"IF( Input!O66=\"\",\"\",Input!O66)","v":""},{"$f":"IF( Input!P66=\"\",\"\",Input!P66)","v":""},{"$f":"IF( Input!O66=\"\",\"\",Input!O66*Input!AL66+Input!AM66)","v":""},{"$f":"IF( Input!Q66=\"\",\"\",Input!Q66)","v":""},{"$f":"IF( Input!R66=\"\",\"\",Input!R66)","v":""},{"$f":"IF( Input!AU66=\"\",\"\",Input!AU66)","v":""},{"$f":"IF( Input!AS66=\"\",\"\",Input!AS66)","v":""},{"$f":"IF( Input!BB66=\"\",\"\",Input!BB66)","v":""},{"$f":"IF(Input!AY66=\"\",\"\",Input!AY66)","v":""},{"$f":"IF(Input!AZ66=\"\",\"\",Input!AZ66)","v":""},null,{"$f":"IF(Input!AR66=\"\",\"\",Input!AR66)","v":""},{"$f":"IF(Input!B66=\"\",\"\",(Input!AN66*Input!AP66+Input!AO66*Input!AQ66)/SUM(Input!AN66:AO66))","v":""},{"$f":"IF(Input!K66=\"\",\"\",Input!K66)","v":""},{"$f":"IF(Input!A66=\"\",\"\",Input!A66)","v":""},{"$f":"IF(Input!AT66=\"\",\"\",Input!AT66)","v":""},{"$f":"IF(Input!BC66=\"\",\"\",Input!BC66)","v":""},{"$f":"IF(Input!BD66=\"\",\"\",Input!BD66)","v":""},{"$f":"IF(Input!BG66=\"\",\"\",Input!BG66)","v":""},{"$f":"IF(Input!AX66=\"\",\"\",Input!AX66)","v":""},{"$f":"IF(Input!V66=\"\",\"\",Input!V66)","v":""}]
["",{"$f":"IF( Input!B67=\"\",\"\",Input!B67)","v":""},{"$f":"IF( Input!C67=\"\",\"\",Input!C67)","v":""},{"$f":"IF( Input!E67=\"\",\"\",Input!E67)","v":""},{"$f":"IF( Input!F67=\"\",\"\",Input!F67)","v":""},{"$f":"IF( Input!G67=\"\",\"\",Input!G67)","v":""},{"$f":"IF( Input!F67=\"\",\"\",Input!F67*Input!Y67+Input!Z67)","v":""},{"$f":"IF( Input!H67=\"\",\"\",Input!H67)","v":""},{"$f":"IF( Input!I67=\"\",\"\",Input!I67)","v":""},{"$f":"IF( Input!AH67=\"\",\"\",Input!AH67)","v":""},{"$f":"IF( Input!AF67=\"\",\"\",Input!AF67)","v":""},{"$f":"IF( Input!L67=\"\",\"\",Input!L67)","v":""},{"$f":"IF( Input!N67=\"\",\"\",Input!N67)","v":""},{"$f":"IF( Input!O67=\"\",\"\",Input!O67)","v":""},{"$f":"IF( Input!P67=\"\",\"\",Input!P67)","v":""},{"$f":"IF( Input!O67=\"\",\"\",Input!O67*Input!AL67+Input!AM67)","v":""},{"$f":"IF( Input!Q67=\"\",\"\",Input!Q67)","v":""},{"$f":"IF( Input!R67=\"\",\"\",Input!R67)","v":""},{"$f":"IF( Input!AU67=\"\",\"\",Input!AU67)","v":""},{"$f":"IF( Input!AS67=\"\",\"\",Input!AS67)","v":""},{"$f":"IF( Input!BB67=\"\",\"\",Input!BB67)","v":""},{"$f":"IF(Input!AY67=\"\",\"\",Input!AY67)","v":""},{"$f":"IF(Input!AZ67=\"\",\"\",Input!AZ67)","v":""},null,{"$f":"IF(Input!AR67=\"\",\"\",Input!AR67)","v":""},{"$f":"IF(Input!B67=\"\",\"\",(Input!AN67*Input!AP67+Input!AO67*Input!AQ67)/SUM(Input!AN67:AO67))","v":""},{"$f":"IF(Input!K67=\"\",\"\",Input!K67)","v":""},{"$f":"IF(Input!A67=\"\",\"\",Input!A67)","v":""},{"$f":"IF(Input!AT67=\"\",\"\",Input!AT67)","v":""},{"$f":"IF(Input!BC67=\"\",\"\",Input!BC67)","v":""},{"$f":"IF(Input!BD67=\"\",\"\",Input!BD67)","v":""},{"$f":"IF(Input!BG67=\"\",\"\",Input!BG67)","v":""},{"$f":"IF(Input!AX67=\"\",\"\",Input!AX67)","v":""},{"$f":"IF(Input!V67=\"\",\"\",Input!V67)","v":""}]
["",{"$f":"IF( Input!B68=\"\",\"\",Input!B68)","v":""},{"$f":"IF( Input!C68=\"\",\"\",Input!C68)","v":""},{"$f":"IF( Input!E68=\"\",\"\",Input!E68)","v":""},{"$f":"IF( Input!F68=\"\",\"\",Input!F68)","v":""},{"$f":"IF( Input!G68=\"\",\"\",Input!G68)","v":""},{"$f":"IF( Input!F68=\"\",\"\",Input!F68*Input!Y68+Input!Z68)","v":""},{"$f":"IF( Input!H68=\"\",\"\",Input!H68)","v":""},{"$f":"IF( Input!I68=\"\",\"\",Input!I68)","v":""},{"$f":"IF( Input!AH68=\"\",\"\",Input!AH68)","v":""},{"$f":"IF( Input!AF68=\"\",\"\",Input!AF68)","v":""},{"$f":"IF( Input!L68=\"\",\"\",Input!L68)","v":""},{"$f":"IF( Input!N68=\"\",\"\",Input!N68)","v":""},{"$f":"IF( Input!O68=\"\",\"\",Input!O68)","v":""},{"$f":"IF( Input!P68=\"\",\"\",Input!P68)","v":""},{"$f":"IF( Input!O68=\"\",\"\",Input!O68*Input!AL68+Input!AM68)","v":""},{"$f":"IF( Input!Q68=\"\",\"\",Input!Q68)","v":""},{"$f":"IF( Input!R68=\"\",\"\",Input!R68)","v":""},{"$f":"IF( Input!AU68=\"\",\"\",Input!AU68)","v":""},{"$f":"IF( Input!AS68=\"\",\"\",Input!AS68)","v":""},{"$f":"IF( Input!BB68=\"\",\"\",Input!BB68)","v":""},{"$f":"IF(Input!AY68=\"\",\"\",Input!AY68)","v":""},{"$f":"IF(Input!AZ68=\"\",\"\",Input!AZ68)","v":""},null,{"$f":"IF(Input!AR68=\"\",\"\",Input!AR68)","v":""},{"$f":"IF(Input!B68=\"\",\"\",(Input!AN68*Input!AP68+Input!AO68*Input!AQ68)/SUM(Input!AN68:AO68))","v":""},{"$f":"IF(Input!K68=\"\",\"\",Input!K68)","v":""},{"$f":"IF(Input!A68=\"\",\"\",Input!A68)","v":""},{"$f":"IF(Input!AT68=\"\",\"\",Input!AT68)","v":""},{"$f":"IF(Input!BC68=\"\",\"\",Input!BC68)","v":""},{"$f":"IF(Input!BD68=\"\",\"\",Input!BD68)","v":""},{"$f":"IF(Input!BG68=\"\",\"\",Input!BG68)","v":""},{"$f":"IF(Input!AX68=\"\",\"\",Input!AX68)","v":""},{"$f":"IF(Input!V68=\"\",\"\",Input!V68)","v":""}]
["",{"$f":"IF( Input!B69=\"\",\"\",Input!B69)","v":""},{"$f":"IF( Input!C69=\"\",\"\",Input!C69)","v":""},{"$f":"IF( Input!E69=\"\",\"\",Input!E69)","v":""},{"$f":"IF( Input!F69=\"\",\"\",Input!F69)","v":""},{"$f":"IF( Input!G69=\"\",\"\",Input!G69)","v":""},{"$f":"IF( Input!F69=\"\",\"\",Input!F69*Input!Y69+Input!Z69)","v":""},{"$f":"IF( Input!H69=\"\",\"\",Input!H69)","v":""},{"$f":"IF( Input!I69=\"\",\"\",Input!I69)","v":""},{"$f":"IF( Input!AH69=\"\",\"\",Input!AH69)","v":""},{"$f":"IF( Input!AF69=\"\",\"\",Input!AF69)","v":""},{"$f":"IF( Input!L69=\"\",\"\",Input!L69)","v":""},{"$f":"IF( Input!N69=\"\",\"\",Input!N69)","v":""},{"$f":"IF( Input!O69=\"\",\"\",Input!O69)","v":""},{"$f":"IF( Input!P69=\"\",\"\",Input!P69)","v":""},{"$f":"IF( Input!O69=\"\",\"\",Input!O69*Input!AL69+Input!AM69)","v":""},{"$f":"IF( Input!Q69=\"\",\"\",Input!Q69)","v":""},{"$f":"IF( Input!R69=\"\",\"\",Input!R69)","v":""},{"$f":"IF( Input!AU69=\"\",\"\",Input!AU69)","v":""},{"$f":"IF( Input!AS69=\"\",\"\",Input!AS69)","v":""},{"$f":"IF( Input!BB69=\"\",\"\",Input!BB69)","v":""},{"$f":"IF(Input!AY69=\"\",\"\",Input!AY69)","v":""},{"$f":"IF(Input!AZ69=\"\",\"\",Input!AZ69)","v":""},null,{"$f":"IF(Input!AR69=\"\",\"\",Input!AR69)","v":""},{"$f":"IF(Input!B69=\"\",\"\",(Input!AN69*Input!AP69+Input!AO69*Input!AQ69)/SUM(Input!AN69:AO69))","v":""},{"$f":"IF(Input!K69=\"\",\"\",Input!K69)","v":""},{"$f":"IF(Input!A69=\"\",\"\",Input!A69)","v":""},{"$f":"IF(Input!AT69=\"\",\"\",Input!AT69)","v":""},{"$f":"IF(Input!BC69=\"\",\"\",Input!BC69)","v":""},{"$f":"IF(Input!BD69=\"\",\"\",Input!BD69)","v":""},{"$f":"IF(Input!BG69=\"\",\"\",Input!BG69)","v":""},{"$f":"IF(Input!AX69=\"\",\"\",Input!AX69)","v":""},{"$f":"IF(Input!V69=\"\",\"\",Input!V69)","v":""}]
["",{"$f":"IF( Input!B70=\"\",\"\",Input!B70)","v":""},{"$f":"IF( Input!C70=\"\",\"\",Input!C70)","v":""},{"$f":"IF( Input!E70=\"\",\"\",Input!E70)","v":""},{"$f":"IF( Input!F70=\"\",\"\",Input!F70)","v":""},{"$f":"IF( Input!G70=\"\",\"\",Input!G70)","v":""},{"$f":"IF( Input!F70=\"\",\"\",Input!F70*Input!Y70+Input!Z70)","v":""},{"$f":"IF( Input!H70=\"\",\"\",Input!H70)","v":""},{"$f":"IF( Input!I70=\"\",\"\",Input!I70)","v":""},{"$f":"IF( Input!AH70=\"\",\"\",Input!AH70)","v":""},{"$f":"IF( Input!AF70=\"\",\"\",Input!AF70)","v":""},{"$f":"IF( Input!L70=\"\",\"\",Input!L70)","v":""},{"$f":"IF( Input!N70=\"\",\"\",Input!N70)","v":""},{"$f":"IF( Input!O70=\"\",\"\",Input!O70)","v":""},{"$f":"IF( Input!P70=\"\",\"\",Input!P70)","v":""},{"$f":"IF( Input!O70=\"\",\"\",Input!O70*Input!AL70+Input!AM70)","v":""},{"$f":"IF( Input!Q70=\"\",\"\",Input!Q70)","v":""},{"$f":"IF( Input!R70=\"\",\"\",Input!R70)","v":""},{"$f":"IF( Input!AU70=\"\",\"\",Input!AU70)","v":""},{"$f":"IF( Input!AS70=\"\",\"\",Input!AS70)","v":""},{"$f":"IF( Input!BB70=\"\",\"\",Input!BB70)","v":""},{"$f":"IF(Input!AY70=\"\",\"\",Input!AY70)","v":""},{"$f":"IF(Input!AZ70=\"\",\"\",Input!AZ70)","v":""},null,{"$f":"IF(Input!AR70=\"\",\"\",Input!AR70)","v":""},{"$f":"IF(Input!B70=\"\",\"\",(Input!AN70*Input!AP70+Input!AO70*Input!AQ70)/SUM(Input!AN70:AO70))","v":""},{"$f":"IF(Input!K70=\"\",\"\",Input!K70)","v":""},{"$f":"IF(Input!A70=\"\",\"\",Input!A70)","v":""},{"$f":"IF(Input!AT70=\"\",\"\",Input!AT70)","v":""},{"$f":"IF(Input!BC70=\"\",\"\",Input!BC70)","v":""},{"$f":"IF(Input!BD70=\"\",\"\",Input!BD70)","v":""},{"$f":"IF(Input!BG70=\"\",\"\",Input!BG70)","v":""},{"$f":"IF(Input!AX70=\"\",\"\",Input!AX70)","v":""},{"$f":"IF(Input!V70=\"\",\"\",Input!V70)","v":""}]
["",{"$f":"IF( Input!B71=\"\",\"\",Input!B71)","v":""},{"$f":"IF( Input!C71=\"\",\"\",Input!C71)","v":""},{"$f":"IF( Input!E71=\"\",\"\",Input!E71)","v":""},{"$f":"IF( Input!F71=\"\",\"\",Input!F71)","v":""},{"$f":"IF( Input!G71=\"\",\"\",Input!G71)","v":""},{"$f":"IF( Input!F71=\"\",\"\",Input!F71*Input!Y71+Input!Z71)","v":""},{"$f":"IF( Input!H71=\"\",\"\",Input!H71)","v":""},{"$f":"IF( Input!I71=\"\",\"\",Input!I71)","v":""},{"$f":"IF( Input!AH71=\"\",\"\",Input!AH71)","v":""},{"$f":"IF( Input!AF71=\"\",\"\",Input!AF71)","v":""},{"$f":"IF( Input!L71=\"\",\"\",Input!L71)","v":""},{"$f":"IF( Input!N71=\"\",\"\",Input!N71)","v":""},{"$f":"IF( Input!O71=\"\",\"\",Input!O71)","v":""},{"$f":"IF( Input!P71=\"\",\"\",Input!P71)","v":""},{"$f":"IF( Input!O71=\"\",\"\",Input!O71*Input!AL71+Input!AM71)","v":""},{"$f":"IF( Input!Q71=\"\",\"\",Input!Q71)","v":""},{"$f":"IF( Input!R71=\"\",\"\",Input!R71)","v":""},{"$f":"IF( Input!AU71=\"\",\"\",Input!AU71)","v":""},{"$f":"IF( Input!AS71=\"\",\"\",Input!AS71)","v":""},{"$f":"IF( Input!BB71=\"\",\"\",Input!BB71)","v":""},{"$f":"IF(Input!AY71=\"\",\"\",Input!AY71)","v":""},{"$f":"IF(Input!AZ71=\"\",\"\",Input!AZ71)","v":""},null,{"$f":"IF(Input!AR71=\"\",\"\",Input!AR71)","v":""},{"$f":"IF(Input!B71=\"\",\"\",(Input!AN71*Input!AP71+Input!AO71*Input!AQ71)/SUM(Input!AN71:AO71))","v":""},{"$f":"IF(Input!K71=\"\",\"\",Input!K71)","v":""},{"$f":"IF(Input!A71=\"\",\"\",Input!A71)","v":""},{"$f":"IF(Input!AT71=\"\",\"\",Input!AT71)","v":""},{"$f":"IF(Input!BC71=\"\",\"\",Input!BC71)","v":""},{"$f":"IF(Input!BD71=\"\",\"\",Input!BD71)","v":""},{"$f":"IF(Input!BG71=\"\",\"\",Input!BG71)","v":""},{"$f":"IF(Input!AX71=\"\",\"\",Input!AX71)","v":""},{"$f":"IF(Input!V71=\"\",\"\",Input!V71)","v":""}]
[{"$f":"IF(B92<>\"\",1,\"\")","v":""},{"$f":"IF( Input!B72=\"\",\"\",Input!B72)","v":""},{"$f":"IF( Input!C72=\"\",\"\",Input!C72)","v":""},{"$f":"IF( Input!E72=\"\",\"\",Input!E72)","v":""},{"$f":"IF( Input!F72=\"\",\"\",Input!F72)","v":""},{"$f":"IF( Input!G72=\"\",\"\",Input!G72)","v":""},{"$f":"IF( Input!F72=\"\",\"\",Input!F72*Input!Y72+Input!Z72)","v":""},{"$f":"IF( Input!H72=\"\",\"\",Input!H72)","v":""},{"$f":"IF( Input!I72=\"\",\"\",Input!I72)","v":""},{"$f":"IF( Input!AH72=\"\",\"\",Input!AH72)","v":""},{"$f":"IF( Input!AF72=\"\",\"\",Input!AF72)","v":""},{"$f":"IF( Input!L72=\"\",\"\",Input!L72)","v":""},{"$f":"IF( Input!N72=\"\",\"\",Input!N72)","v":""},{"$f":"IF( Input!O72=\"\",\"\",Input!O72)","v":""},{"$f":"IF( Input!P72=\"\",\"\",Input!P72)","v":""},{"$f":"IF( Input!O72=\"\",\"\",Input!O72*Input!AL72+Input!AM72)","v":""},{"$f":"IF( Input!Q72=\"\",\"\",Input!Q72)","v":""},{"$f":"IF( Input!R72=\"\",\"\",Input!R72)","v":""},{"$f":"IF( Input!AU72=\"\",\"\",Input!AU72)","v":""},{"$f":"IF( Input!AS72=\"\",\"\",Input!AS72)","v":""},{"$f":"IF( Input!BB72=\"\",\"\",Input!BB72)","v":""},{"$f":"IF(Input!AY72=\"\",\"\",Input!AY72)","v":""},{"$f":"IF(Input!AZ72=\"\",\"\",Input!AZ72)","v":""},null,{"$f":"IF(Input!AR72=\"\",\"\",Input!AR72)","v":""},{"$f":"IF(Input!B72=\"\",\"\",(Input!AN72*Input!AP72+Input!AO72*Input!AQ72)/SUM(Input!AN72:AO72))","v":""},{"$f":"IF(Input!K72=\"\",\"\",Input!K72)","v":""},{"$f":"IF(Input!A72=\"\",\"\",Input!A72)","v":""},{"$f":"IF(Input!AT72=\"\",\"\",Input!AT72)","v":""},{"$f":"IF(Input!BC72=\"\",\"\",Input!BC72)","v":""},{"$f":"IF(Input!BD72=\"\",\"\",Input!BD72)","v":""},{"$f":"IF(Input!BG72=\"\",\"\",Input!BG72)","v":""},{"$f":"IF(Input!AX72=\"\",\"\",Input!AX72)","v":""},{"$f":"IF(Input!V72=\"\",\"\",Input!V72)","v":""}]
["",{"$f":"IF( Input!B73=\"\",\"\",Input!B73)","v":""},{"$f":"IF( Input!C73=\"\",\"\",Input!C73)","v":""},{"$f":"IF( Input!E73=\"\",\"\",Input!E73)","v":""},{"$f":"IF( Input!F73=\"\",\"\",Input!F73)","v":""},{"$f":"IF( Input!G73=\"\",\"\",Input!G73)","v":""},{"$f":"IF( Input!F73=\"\",\"\",Input!F73*Input!Y73+Input!Z73)","v":""},{"$f":"IF( Input!H73=\"\",\"\",Input!H73)","v":""},{"$f":"IF( Input!I73=\"\",\"\",Input!I73)","v":""},{"$f":"IF( Input!AH73=\"\",\"\",Input!AH73)","v":""},{"$f":"IF( Input!AF73=\"\",\"\",Input!AF73)","v":""},{"$f":"IF( Input!L73=\"\",\"\",Input!L73)","v":""},{"$f":"IF( Input!N73=\"\",\"\",Input!N73)","v":""},{"$f":"IF( Input!O73=\"\",\"\",Input!O73)","v":""},{"$f":"IF( Input!P73=\"\",\"\",Input!P73)","v":""},{"$f":"IF( Input!O73=\"\",\"\",Input!O73*Input!AL73+Input!AM73)","v":""},{"$f":"IF( Input!Q73=\"\",\"\",Input!Q73)","v":""},{"$f":"IF( Input!R73=\"\",\"\",Input!R73)","v":""},{"$f":"IF( Input!AU73=\"\",\"\",Input!AU73)","v":""},{"$f":"IF( Input!AS73=\"\",\"\",Input!AS73)","v":""},{"$f":"IF( Input!BB73=\"\",\"\",Input!BB73)","v":""},{"$f":"IF(Input!AY73=\"\",\"\",Input!AY73)","v":""},{"$f":"IF(Input!AZ73=\"\",\"\",Input!AZ73)","v":""},null,{"$f":"IF(Input!AR73=\"\",\"\",Input!AR73)","v":""},{"$f":"IF(Input!B73=\"\",\"\",(Input!AN73*Input!AP73+Input!AO73*Input!AQ73)/SUM(Input!AN73:AO73))","v":""},{"$f":"IF(Input!K73=\"\",\"\",Input!K73)","v":""},{"$f":"IF(Input!A73=\"\",\"\",Input!A73)","v":""},{"$f":"IF(Input!AT73=\"\",\"\",Input!AT73)","v":""},{"$f":"IF(Input!BC73=\"\",\"\",Input!BC73)","v":""},{"$f":"IF(Input!BD73=\"\",\"\",Input!BD73)","v":""},{"$f":"IF(Input!BG73=\"\",\"\",Input!BG73)","v":""},{"$f":"IF(Input!AX73=\"\",\"\",Input!AX73)","v":""},{"$f":"IF(Input!V73=\"\",\"\",Input!V73)","v":""}]
["",{"$f":"IF( Input!B74=\"\",\"\",Input!B74)","v":""},{"$f":"IF( Input!C74=\"\",\"\",Input!C74)","v":""},{"$f":"IF( Input!E74=\"\",\"\",Input!E74)","v":""},{"$f":"IF( Input!F74=\"\",\"\",Input!F74)","v":""},{"$f":"IF( Input!G74=\"\",\"\",Input!G74)","v":""},{"$f":"IF( Input!F74=\"\",\"\",Input!F74*Input!Y74+Input!Z74)","v":""},{"$f":"IF( Input!H74=\"\",\"\",Input!H74)","v":""},{"$f":"IF( Input!I74=\"\",\"\",Input!I74)","v":""},{"$f":"IF( Input!AH74=\"\",\"\",Input!AH74)","v":""},{"$f":"IF( Input!AF74=\"\",\"\",Input!AF74)","v":""},{"$f":"IF( Input!L74=\"\",\"\",Input!L74)","v":""},{"$f":"IF( Input!N74=\"\",\"\",Input!N74)","v":""},{"$f":"IF( Input!O74=\"\",\"\",Input!O74)","v":""},{"$f":"IF( Input!P74=\"\",\"\",Input!P74)","v":""},{"$f":"IF( Input!O74=\"\",\"\",Input!O74*Input!AL74+Input!AM74)","v":""},{"$f":"IF( Input!Q74=\"\",\"\",Input!Q74)","v":""},{"$f":"IF( Input!R74=\"\",\"\",Input!R74)","v":""},{"$f":"IF( Input!AU74=\"\",\"\",Input!AU74)","v":""},{"$f":"IF( Input!AS74=\"\",\"\",Input!AS74)","v":""},{"$f":"IF( Input!BB74=\"\",\"\",Input!BB74)","v":""},{"$f":"IF(Input!AY74=\"\",\"\",Input!AY74)","v":""},{"$f":"IF(Input!AZ74=\"\",\"\",Input!AZ74)","v":""},null,{"$f":"IF(Input!AR74=\"\",\"\",Input!AR74)","v":""},{"$f":"IF(Input!B74=\"\",\"\",(Input!AN74*Input!AP74+Input!AO74*Input!AQ74)/SUM(Input!AN74:AO74))","v":""},{"$f":"IF(Input!K74=\"\",\"\",Input!K74)","v":""},{"$f":"IF(Input!A74=\"\",\"\",Input!A74)","v":""},{"$f":"IF(Input!AT74=\"\",\"\",Input!AT74)","v":""},{"$f":"IF(Input!BC74=\"\",\"\",Input!BC74)","v":""},{"$f":"IF(Input!BD74=\"\",\"\",Input!BD74)","v":""},{"$f":"IF(Input!BG74=\"\",\"\",Input!BG74)","v":""},{"$f":"IF(Input!AX74=\"\",\"\",Input!AX74)","v":""},{"$f":"IF(Input!V74=\"\",\"\",Input!V74)","v":""}]
["",{"$f":"IF( Input!B75=\"\",\"\",Input!B75)","v":""},{"$f":"IF( Input!C75=\"\",\"\",Input!C75)","v":""},{"$f":"IF( Input!E75=\"\",\"\",Input!E75)","v":""},{"$f":"IF( Input!F75=\"\",\"\",Input!F75)","v":""},{"$f":"IF( Input!G75=\"\",\"\",Input!G75)","v":""},{"$f":"IF( Input!F75=\"\",\"\",Input!F75*Input!Y75+Input!Z75)","v":""},{"$f":"IF( Input!H75=\"\",\"\",Input!H75)","v":""},{"$f":"IF( Input!I75=\"\",\"\",Input!I75)","v":""},{"$f":"IF( Input!AH75=\"\",\"\",Input!AH75)","v":""},{"$f":"IF( Input!AF75=\"\",\"\",Input!AF75)","v":""},{"$f":"IF( Input!L75=\"\",\"\",Input!L75)","v":""},{"$f":"IF( Input!N75=\"\",\"\",Input!N75)","v":""},{"$f":"IF( Input!O75=\"\",\"\",Input!O75)","v":""},{"$f":"IF( Input!P75=\"\",\"\",Input!P75)","v":""},{"$f":"IF( Input!O75=\"\",\"\",Input!O75*Input!AL75+Input!AM75)","v":""},{"$f":"IF( Input!Q75=\"\",\"\",Input!Q75)","v":""},{"$f":"IF( Input!R75=\"\",\"\",Input!R75)","v":""},{"$f":"IF( Input!AU75=\"\",\"\",Input!AU75)","v":""},{"$f":"IF( Input!AS75=\"\",\"\",Input!AS75)","v":""},{"$f":"IF( Input!BB75=\"\",\"\",Input!BB75)","v":""},{"$f":"IF(Input!AY75=\"\",\"\",Input!AY75)","v":""},{"$f":"IF(Input!AZ75=\"\",\"\",Input!AZ75)","v":""},null,{"$f":"IF(Input!AR75=\"\",\"\",Input!AR75)","v":""},{"$f":"IF(Input!B75=\"\",\"\",(Input!AN75*Input!AP75+Input!AO75*Input!AQ75)/SUM(Input!AN75:AO75))","v":""},{"$f":"IF(Input!K75=\"\",\"\",Input!K75)","v":""},{"$f":"IF(Input!A75=\"\",\"\",Input!A75)","v":""},{"$f":"IF(Input!AT75=\"\",\"\",Input!AT75)","v":""},{"$f":"IF(Input!BC75=\"\",\"\",Input!BC75)","v":""},{"$f":"IF(Input!BD75=\"\",\"\",Input!BD75)","v":""},{"$f":"IF(Input!BG75=\"\",\"\",Input!BG75)","v":""},{"$f":"IF(Input!AX75=\"\",\"\",Input!AX75)","v":""},{"$f":"IF(Input!V75=\"\",\"\",Input!V75)","v":""}]
["",{"$f":"IF( Input!B76=\"\",\"\",Input!B76)","v":""},{"$f":"IF( Input!C76=\"\",\"\",Input!C76)","v":""},{"$f":"IF( Input!E76=\"\",\"\",Input!E76)","v":""},{"$f":"IF( Input!F76=\"\",\"\",Input!F76)","v":""},{"$f":"IF( Input!G76=\"\",\"\",Input!G76)","v":""},{"$f":"IF( Input!F76=\"\",\"\",Input!F76*Input!Y76+Input!Z76)","v":""},{"$f":"IF( Input!H76=\"\",\"\",Input!H76)","v":""},{"$f":"IF( Input!I76=\"\",\"\",Input!I76)","v":""},{"$f":"IF( Input!AH76=\"\",\"\",Input!AH76)","v":""},{"$f":"IF( Input!AF76=\"\",\"\",Input!AF76)","v":""},{"$f":"IF( Input!L76=\"\",\"\",Input!L76)","v":""},{"$f":"IF( Input!N76=\"\",\"\",Input!N76)","v":""},{"$f":"IF( Input!O76=\"\",\"\",Input!O76)","v":""},{"$f":"IF( Input!P76=\"\",\"\",Input!P76)","v":""},{"$f":"IF( Input!O76=\"\",\"\",Input!O76*Input!AL76+Input!AM76)","v":""},{"$f":"IF( Input!Q76=\"\",\"\",Input!Q76)","v":""},{"$f":"IF( Input!R76=\"\",\"\",Input!R76)","v":""},{"$f":"IF( Input!AU76=\"\",\"\",Input!AU76)","v":""},{"$f":"IF( Input!AS76=\"\",\"\",Input!AS76)","v":""},{"$f":"IF( Input!BB76=\"\",\"\",Input!BB76)","v":""},{"$f":"IF(Input!AY76=\"\",\"\",Input!AY76)","v":""},{"$f":"IF(Input!AZ76=\"\",\"\",Input!AZ76)","v":""},null,{"$f":"IF(Input!AR76=\"\",\"\",Input!AR76)","v":""},{"$f":"IF(Input!B76=\"\",\"\",(Input!AN76*Input!AP76+Input!AO76*Input!AQ76)/SUM(Input!AN76:AO76))","v":""},{"$f":"IF(Input!K76=\"\",\"\",Input!K76)","v":""},{"$f":"IF(Input!A76=\"\",\"\",Input!A76)","v":""},{"$f":"IF(Input!AT76=\"\",\"\",Input!AT76)","v":""},{"$f":"IF(Input!BC76=\"\",\"\",Input!BC76)","v":""},{"$f":"IF(Input!BD76=\"\",\"\",Input!BD76)","v":""},{"$f":"IF(Input!BG76=\"\",\"\",Input!BG76)","v":""},{"$f":"IF(Input!AX76=\"\",\"\",Input!AX76)","v":""},{"$f":"IF(Input!V76=\"\",\"\",Input!V76)","v":""}]
["",{"$f":"IF( Input!B77=\"\",\"\",Input!B77)","v":""},{"$f":"IF( Input!C77=\"\",\"\",Input!C77)","v":""},{"$f":"IF( Input!E77=\"\",\"\",Input!E77)","v":""},{"$f":"IF( Input!F77=\"\",\"\",Input!F77)","v":""},{"$f":"IF( Input!G77=\"\",\"\",Input!G77)","v":""},{"$f":"IF( Input!F77=\"\",\"\",Input!F77*Input!Y77+Input!Z77)","v":""},{"$f":"IF( Input!H77=\"\",\"\",Input!H77)","v":""},{"$f":"IF( Input!I77=\"\",\"\",Input!I77)","v":""},{"$f":"IF( Input!AH77=\"\",\"\",Input!AH77)","v":""},{"$f":"IF( Input!AF77=\"\",\"\",Input!AF77)","v":""},{"$f":"IF( Input!L77=\"\",\"\",Input!L77)","v":""},{"$f":"IF( Input!N77=\"\",\"\",Input!N77)","v":""},{"$f":"IF( Input!O77=\"\",\"\",Input!O77)","v":""},{"$f":"IF( Input!P77=\"\",\"\",Input!P77)","v":""},{"$f":"IF( Input!O77=\"\",\"\",Input!O77*Input!AL77+Input!AM77)","v":""},{"$f":"IF( Input!Q77=\"\",\"\",Input!Q77)","v":""},{"$f":"IF( Input!R77=\"\",\"\",Input!R77)","v":""},{"$f":"IF( Input!AU77=\"\",\"\",Input!AU77)","v":""},{"$f":"IF( Input!AS77=\"\",\"\",Input!AS77)","v":""},{"$f":"IF( Input!BB77=\"\",\"\",Input!BB77)","v":""},{"$f":"IF(Input!AY77=\"\",\"\",Input!AY77)","v":""},{"$f":"IF(Input!AZ77=\"\",\"\",Input!AZ77)","v":""},null,{"$f":"IF(Input!AR77=\"\",\"\",Input!AR77)","v":""},{"$f":"IF(Input!B77=\"\",\"\",(Input!AN77*Input!AP77+Input!AO77*Input!AQ77)/SUM(Input!AN77:AO77))","v":""},{"$f":"IF(Input!K77=\"\",\"\",Input!K77)","v":""},{"$f":"IF(Input!A77=\"\",\"\",Input!A77)","v":""},{"$f":"IF(Input!AT77=\"\",\"\",Input!AT77)","v":""},{"$f":"IF(Input!BC77=\"\",\"\",Input!BC77)","v":""},{"$f":"IF(Input!BD77=\"\",\"\",Input!BD77)","v":""},{"$f":"IF(Input!BG77=\"\",\"\",Input!BG77)","v":""},{"$f":"IF(Input!AX77=\"\",\"\",Input!AX77)","v":""},{"$f":"IF(Input!V77=\"\",\"\",Input!V77)","v":""}]
["",{"$f":"IF( Input!B78=\"\",\"\",Input!B78)","v":""},{"$f":"IF( Input!C78=\"\",\"\",Input!C78)","v":""},{"$f":"IF( Input!E78=\"\",\"\",Input!E78)","v":""},{"$f":"IF( Input!F78=\"\",\"\",Input!F78)","v":""},{"$f":"IF( Input!G78=\"\",\"\",Input!G78)","v":""},{"$f":"IF( Input!F78=\"\",\"\",Input!F78*Input!Y78+Input!Z78)","v":""},{"$f":"IF( Input!H78=\"\",\"\",Input!H78)","v":""},{"$f":"IF( Input!I78=\"\",\"\",Input!I78)","v":""},{"$f":"IF( Input!AH78=\"\",\"\",Input!AH78)","v":""},{"$f":"IF( Input!AF78=\"\",\"\",Input!AF78)","v":""},{"$f":"IF( Input!L78=\"\",\"\",Input!L78)","v":""},{"$f":"IF( Input!N78=\"\",\"\",Input!N78)","v":""},{"$f":"IF( Input!O78=\"\",\"\",Input!O78)","v":""},{"$f":"IF( Input!P78=\"\",\"\",Input!P78)","v":""},{"$f":"IF( Input!O78=\"\",\"\",Input!O78*Input!AL78+Input!AM78)","v":""},{"$f":"IF( Input!Q78=\"\",\"\",Input!Q78)","v":""},{"$f":"IF( Input!R78=\"\",\"\",Input!R78)","v":""},{"$f":"IF( Input!AU78=\"\",\"\",Input!AU78)","v":""},{"$f":"IF( Input!AS78=\"\",\"\",Input!AS78)","v":""},{"$f":"IF( Input!BB78=\"\",\"\",Input!BB78)","v":""},{"$f":"IF(Input!AY78=\"\",\"\",Input!AY78)","v":""},{"$f":"IF(Input!AZ78=\"\",\"\",Input!AZ78)","v":""},null,{"$f":"IF(Input!AR78=\"\",\"\",Input!AR78)","v":""},{"$f":"IF(Input!B78=\"\",\"\",(Input!AN78*Input!AP78+Input!AO78*Input!AQ78)/SUM(Input!AN78:AO78))","v":""},{"$f":"IF(Input!K78=\"\",\"\",Input!K78)","v":""},{"$f":"IF(Input!A78=\"\",\"\",Input!A78)","v":""},{"$f":"IF(Input!AT78=\"\",\"\",Input!AT78)","v":""},{"$f":"IF(Input!BC78=\"\",\"\",Input!BC78)","v":""},{"$f":"IF(Input!BD78=\"\",\"\",Input!BD78)","v":""},{"$f":"IF(Input!BG78=\"\",\"\",Input!BG78)","v":""},{"$f":"IF(Input!AX78=\"\",\"\",Input!AX78)","v":""},{"$f":"IF(Input!V78=\"\",\"\",Input!V78)","v":""}]
["",{"$f":"IF( Input!B79=\"\",\"\",Input!B79)","v":""},{"$f":"IF( Input!C79=\"\",\"\",Input!C79)","v":""},{"$f":"IF( Input!E79=\"\",\"\",Input!E79)","v":""},{"$f":"IF( Input!F79=\"\",\"\",Input!F79)","v":""},{"$f":"IF( Input!G79=\"\",\"\",Input!G79)","v":""},{"$f":"IF( Input!F79=\"\",\"\",Input!F79*Input!Y79+Input!Z79)","v":""},{"$f":"IF( Input!H79=\"\",\"\",Input!H79)","v":""},{"$f":"IF( Input!I79=\"\",\"\",Input!I79)","v":""},{"$f":"IF( Input!AH79=\"\",\"\",Input!AH79)","v":""},{"$f":"IF( Input!AF79=\"\",\"\",Input!AF79)","v":""},{"$f":"IF( Input!L79=\"\",\"\",Input!L79)","v":""},{"$f":"IF( Input!N79=\"\",\"\",Input!N79)","v":""},{"$f":"IF( Input!O79=\"\",\"\",Input!O79)","v":""},{"$f":"IF( Input!P79=\"\",\"\",Input!P79)","v":""},{"$f":"IF( Input!O79=\"\",\"\",Input!O79*Input!AL79+Input!AM79)","v":""},{"$f":"IF( Input!Q79=\"\",\"\",Input!Q79)","v":""},{"$f":"IF( Input!R79=\"\",\"\",Input!R79)","v":""},{"$f":"IF( Input!AU79=\"\",\"\",Input!AU79)","v":""},{"$f":"IF( Input!AS79=\"\",\"\",Input!AS79)","v":""},{"$f":"IF( Input!BB79=\"\",\"\",Input!BB79)","v":""},{"$f":"IF(Input!AY79=\"\",\"\",Input!AY79)","v":""},{"$f":"IF(Input!AZ79=\"\",\"\",Input!AZ79)","v":""},null,{"$f":"IF(Input!AR79=\"\",\"\",Input!AR79)","v":""},{"$f":"IF(Input!B79=\"\",\"\",(Input!AN79*Input!AP79+Input!AO79*Input!AQ79)/SUM(Input!AN79:AO79))","v":""},{"$f":"IF(Input!K79=\"\",\"\",Input!K79)","v":""},{"$f":"IF(Input!A79=\"\",\"\",Input!A79)","v":""},{"$f":"IF(Input!AT79=\"\",\"\",Input!AT79)","v":""},{"$f":"IF(Input!BC79=\"\",\"\",Input!BC79)","v":""},{"$f":"IF(Input!BD79=\"\",\"\",Input!BD79)","v":""},{"$f":"IF(Input!BG79=\"\",\"\",Input!BG79)","v":""},{"$f":"IF(Input!AX79=\"\",\"\",Input!AX79)","v":""},{"$f":"IF(Input!V79=\"\",\"\",Input!V79)","v":""}]
["",{"$f":"IF( Input!B80=\"\",\"\",Input!B80)","v":""},{"$f":"IF( Input!C80=\"\",\"\",Input!C80)","v":""},{"$f":"IF( Input!E80=\"\",\"\",Input!E80)","v":""},{"$f":"IF( Input!F80=\"\",\"\",Input!F80)","v":""},{"$f":"IF( Input!G80=\"\",\"\",Input!G80)","v":""},{"$f":"IF( Input!F80=\"\",\"\",Input!F80*Input!Y80+Input!Z80)","v":""},{"$f":"IF( Input!H80=\"\",\"\",Input!H80)","v":""},{"$f":"IF( Input!I80=\"\",\"\",Input!I80)","v":""},{"$f":"IF( Input!AH80=\"\",\"\",Input!AH80)","v":""},{"$f":"IF( Input!AF80=\"\",\"\",Input!AF80)","v":""},{"$f":"IF( Input!L80=\"\",\"\",Input!L80)","v":""},{"$f":"IF( Input!N80=\"\",\"\",Input!N80)","v":""},{"$f":"IF( Input!O80=\"\",\"\",Input!O80)","v":""},{"$f":"IF( Input!P80=\"\",\"\",Input!P80)","v":""},{"$f":"IF( Input!O80=\"\",\"\",Input!O80*Input!AL80+Input!AM80)","v":""},{"$f":"IF( Input!Q80=\"\",\"\",Input!Q80)","v":""},{"$f":"IF( Input!R80=\"\",\"\",Input!R80)","v":""},{"$f":"IF( Input!AU80=\"\",\"\",Input!AU80)","v":""},{"$f":"IF( Input!AS80=\"\",\"\",Input!AS80)","v":""},{"$f":"IF( Input!BB80=\"\",\"\",Input!BB80)","v":""},{"$f":"IF(Input!AY80=\"\",\"\",Input!AY80)","v":""},{"$f":"IF(Input!AZ80=\"\",\"\",Input!AZ80)","v":""},null,{"$f":"IF(Input!AR80=\"\",\"\",Input!AR80)","v":""},{"$f":"IF(Input!B80=\"\",\"\",(Input!AN80*Input!AP80+Input!AO80*Input!AQ80)/SUM(Input!AN80:AO80))","v":""},{"$f":"IF(Input!K80=\"\",\"\",Input!K80)","v":""},{"$f":"IF(Input!A80=\"\",\"\",Input!A80)","v":""},{"$f":"IF(Input!AT80=\"\",\"\",Input!AT80)","v":""},{"$f":"IF(Input!BC80=\"\",\"\",Input!BC80)","v":""},{"$f":"IF(Input!BD80=\"\",\"\",Input!BD80)","v":""},{"$f":"IF(Input!BG80=\"\",\"\",Input!BG80)","v":""},{"$f":"IF(Input!AX80=\"\",\"\",Input!AX80)","v":""},{"$f":"IF(Input!V80=\"\",\"\",Input!V80)","v":""}]
["",{"$f":"IF( Input!B81=\"\",\"\",Input!B81)","v":""},{"$f":"IF( Input!C81=\"\",\"\",Input!C81)","v":""},{"$f":"IF( Input!E81=\"\",\"\",Input!E81)","v":""},{"$f":"IF( Input!F81=\"\",\"\",Input!F81)","v":""},{"$f":"IF( Input!G81=\"\",\"\",Input!G81)","v":""},{"$f":"IF( Input!F81=\"\",\"\",Input!F81*Input!Y81+Input!Z81)","v":""},{"$f":"IF( Input!H81=\"\",\"\",Input!H81)","v":""},{"$f":"IF( Input!I81=\"\",\"\",Input!I81)","v":""},{"$f":"IF( Input!AH81=\"\",\"\",Input!AH81)","v":""},{"$f":"IF( Input!AF81=\"\",\"\",Input!AF81)","v":""},{"$f":"IF( Input!L81=\"\",\"\",Input!L81)","v":""},{"$f":"IF( Input!N81=\"\",\"\",Input!N81)","v":""},{"$f":"IF( Input!O81=\"\",\"\",Input!O81)","v":""},{"$f":"IF( Input!P81=\"\",\"\",Input!P81)","v":""},{"$f":"IF( Input!O81=\"\",\"\",Input!O81*Input!AL81+Input!AM81)","v":""},{"$f":"IF( Input!Q81=\"\",\"\",Input!Q81)","v":""},{"$f":"IF( Input!R81=\"\",\"\",Input!R81)","v":""},{"$f":"IF( Input!AU81=\"\",\"\",Input!AU81)","v":""},{"$f":"IF( Input!AS81=\"\",\"\",Input!AS81)","v":""},{"$f":"IF( Input!BB81=\"\",\"\",Input!BB81)","v":""},{"$f":"IF(Input!AY81=\"\",\"\",Input!AY81)","v":""},{"$f":"IF(Input!AZ81=\"\",\"\",Input!AZ81)","v":""},null,{"$f":"IF(Input!AR81=\"\",\"\",Input!AR81)","v":""},{"$f":"IF(Input!B81=\"\",\"\",(Input!AN81*Input!AP81+Input!AO81*Input!AQ81)/SUM(Input!AN81:AO81))","v":""},{"$f":"IF(Input!K81=\"\",\"\",Input!K81)","v":""},{"$f":"IF(Input!A81=\"\",\"\",Input!A81)","v":""},{"$f":"IF(Input!AT81=\"\",\"\",Input!AT81)","v":""},{"$f":"IF(Input!BC81=\"\",\"\",Input!BC81)","v":""},{"$f":"IF(Input!BD81=\"\",\"\",Input!BD81)","v":""},{"$f":"IF(Input!BG81=\"\",\"\",Input!BG81)","v":""},{"$f":"IF(Input!AX81=\"\",\"\",Input!AX81)","v":""},{"$f":"IF(Input!V81=\"\",\"\",Input!V81)","v":""}]
["",{"$f":"IF( Input!B82=\"\",\"\",Input!B82)","v":""},{"$f":"IF( Input!C82=\"\",\"\",Input!C82)","v":""},{"$f":"IF( Input!E82=\"\",\"\",Input!E82)","v":""},{"$f":"IF( Input!F82=\"\",\"\",Input!F82)","v":""},{"$f":"IF( Input!G82=\"\",\"\",Input!G82)","v":""},{"$f":"IF( Input!F82=\"\",\"\",Input!F82*Input!Y82+Input!Z82)","v":""},{"$f":"IF( Input!H82=\"\",\"\",Input!H82)","v":""},{"$f":"IF( Input!I82=\"\",\"\",Input!I82)","v":""},{"$f":"IF( Input!AH82=\"\",\"\",Input!AH82)","v":""},{"$f":"IF( Input!AF82=\"\",\"\",Input!AF82)","v":""},{"$f":"IF( Input!L82=\"\",\"\",Input!L82)","v":""},{"$f":"IF( Input!N82=\"\",\"\",Input!N82)","v":""},{"$f":"IF( Input!O82=\"\",\"\",Input!O82)","v":""},{"$f":"IF( Input!P82=\"\",\"\",Input!P82)","v":""},{"$f":"IF( Input!O82=\"\",\"\",Input!O82*Input!AL82+Input!AM82)","v":""},{"$f":"IF( Input!Q82=\"\",\"\",Input!Q82)","v":""},{"$f":"IF( Input!R82=\"\",\"\",Input!R82)","v":""},{"$f":"IF( Input!AU82=\"\",\"\",Input!AU82)","v":""},{"$f":"IF( Input!AS82=\"\",\"\",Input!AS82)","v":""},{"$f":"IF( Input!BB82=\"\",\"\",Input!BB82)","v":""},{"$f":"IF(Input!AY82=\"\",\"\",Input!AY82)","v":""},{"$f":"IF(Input!AZ82=\"\",\"\",Input!AZ82)","v":""},null,{"$f":"IF(Input!AR82=\"\",\"\",Input!AR82)","v":""},{"$f":"IF(Input!B82=\"\",\"\",(Input!AN82*Input!AP82+Input!AO82*Input!AQ82)/SUM(Input!AN82:AO82))","v":""},{"$f":"IF(Input!K82=\"\",\"\",Input!K82)","v":""},{"$f":"IF(Input!A82=\"\",\"\",Input!A82)","v":""},{"$f":"IF(Input!AT82=\"\",\"\",Input!AT82)","v":""},{"$f":"IF(Input!BC82=\"\",\"\",Input!BC82)","v":""},{"$f":"IF(Input!BD82=\"\",\"\",Input!BD82)","v":""},{"$f":"IF(Input!BG82=\"\",\"\",Input!BG82)","v":""},{"$f":"IF(Input!AX82=\"\",\"\",Input!AX82)","v":""},{"$f":"IF(Input!V82=\"\",\"\",Input!V82)","v":""}]
["",{"$f":"IF( Input!B83=\"\",\"\",Input!B83)","v":""},{"$f":"IF( Input!C83=\"\",\"\",Input!C83)","v":""},{"$f":"IF( Input!E83=\"\",\"\",Input!E83)","v":""},{"$f":"IF( Input!F83=\"\",\"\",Input!F83)","v":""},{"$f":"IF( Input!G83=\"\",\"\",Input!G83)","v":""},{"$f":"IF( Input!F83=\"\",\"\",Input!F83*Input!Y83+Input!Z83)","v":""},{"$f":"IF( Input!H83=\"\",\"\",Input!H83)","v":""},{"$f":"IF( Input!I83=\"\",\"\",Input!I83)","v":""},{"$f":"IF( Input!AH83=\"\",\"\",Input!AH83)","v":""},{"$f":"IF( Input!AF83=\"\",\"\",Input!AF83)","v":""},{"$f":"IF( Input!L83=\"\",\"\",Input!L83)","v":""},{"$f":"IF( Input!N83=\"\",\"\",Input!N83)","v":""},{"$f":"IF( Input!O83=\"\",\"\",Input!O83)","v":""},{"$f":"IF( Input!P83=\"\",\"\",Input!P83)","v":""},{"$f":"IF( Input!O83=\"\",\"\",Input!O83*Input!AL83+Input!AM83)","v":""},{"$f":"IF( Input!Q83=\"\",\"\",Input!Q83)","v":""},{"$f":"IF( Input!R83=\"\",\"\",Input!R83)","v":""},{"$f":"IF( Input!AU83=\"\",\"\",Input!AU83)","v":""},{"$f":"IF( Input!AS83=\"\",\"\",Input!AS83)","v":""},{"$f":"IF( Input!BB83=\"\",\"\",Input!BB83)","v":""},{"$f":"IF(Input!AY83=\"\",\"\",Input!AY83)","v":""},{"$f":"IF(Input!AZ83=\"\",\"\",Input!AZ83)","v":""},null,{"$f":"IF(Input!AR83=\"\",\"\",Input!AR83)","v":""},{"$f":"IF(Input!B83=\"\",\"\",(Input!AN83*Input!AP83+Input!AO83*Input!AQ83)/SUM(Input!AN83:AO83))","v":""},{"$f":"IF(Input!K83=\"\",\"\",Input!K83)","v":""},{"$f":"IF(Input!A83=\"\",\"\",Input!A83)","v":""},{"$f":"IF(Input!AT83=\"\",\"\",Input!AT83)","v":""},{"$f":"IF(Input!BC83=\"\",\"\",Input!BC83)","v":""},{"$f":"IF(Input!BD83=\"\",\"\",Input!BD83)","v":""},{"$f":"IF(Input!BG83=\"\",\"\",Input!BG83)","v":""},{"$f":"IF(Input!AX83=\"\",\"\",Input!AX83)","v":""},{"$f":"IF(Input!V83=\"\",\"\",Input!V83)","v":""}]
["",{"$f":"IF( Input!B84=\"\",\"\",Input!B84)","v":""},{"$f":"IF( Input!C84=\"\",\"\",Input!C84)","v":""},{"$f":"IF( Input!E84=\"\",\"\",Input!E84)","v":""},{"$f":"IF( Input!F84=\"\",\"\",Input!F84)","v":""},{"$f":"IF( Input!G84=\"\",\"\",Input!G84)","v":""},{"$f":"IF( Input!F84=\"\",\"\",Input!F84*Input!Y84+Input!Z84)","v":""},{"$f":"IF( Input!H84=\"\",\"\",Input!H84)","v":""},{"$f":"IF( Input!I84=\"\",\"\",Input!I84)","v":""},{"$f":"IF( Input!AH84=\"\",\"\",Input!AH84)","v":""},{"$f":"IF( Input!AF84=\"\",\"\",Input!AF84)","v":""},{"$f":"IF( Input!L84=\"\",\"\",Input!L84)","v":""},{"$f":"IF( Input!N84=\"\",\"\",Input!N84)","v":""},{"$f":"IF( Input!O84=\"\",\"\",Input!O84)","v":""},{"$f":"IF( Input!P84=\"\",\"\",Input!P84)","v":""},{"$f":"IF( Input!O84=\"\",\"\",Input!O84*Input!AL84+Input!AM84)","v":""},{"$f":"IF( Input!Q84=\"\",\"\",Input!Q84)","v":""},{"$f":"IF( Input!R84=\"\",\"\",Input!R84)","v":""},{"$f":"IF( Input!AU84=\"\",\"\",Input!AU84)","v":""},{"$f":"IF( Input!AS84=\"\",\"\",Input!AS84)","v":""},{"$f":"IF( Input!BB84=\"\",\"\",Input!BB84)","v":""},{"$f":"IF(Input!AY84=\"\",\"\",Input!AY84)","v":""},{"$f":"IF(Input!AZ84=\"\",\"\",Input!AZ84)","v":""},null,{"$f":"IF(Input!AR84=\"\",\"\",Input!AR84)","v":""},{"$f":"IF(Input!B84=\"\",\"\",(Input!AN84*Input!AP84+Input!AO84*Input!AQ84)/SUM(Input!AN84:AO84))","v":""},{"$f":"IF(Input!K84=\"\",\"\",Input!K84)","v":""},{"$f":"IF(Input!A84=\"\",\"\",Input!A84)","v":""},{"$f":"IF(Input!AT84=\"\",\"\",Input!AT84)","v":""},{"$f":"IF(Input!BC84=\"\",\"\",Input!BC84)","v":""},{"$f":"IF(Input!BD84=\"\",\"\",Input!BD84)","v":""},{"$f":"IF(Input!BG84=\"\",\"\",Input!BG84)","v":""},{"$f":"IF(Input!AX84=\"\",\"\",Input!AX84)","v":""},{"$f":"IF(Input!V84=\"\",\"\",Input!V84)","v":""}]
["",{"$f":"IF( Input!B85=\"\",\"\",Input!B85)","v":""},{"$f":"IF( Input!C85=\"\",\"\",Input!C85)","v":""},{"$f":"IF( Input!E85=\"\",\"\",Input!E85)","v":""},{"$f":"IF( Input!F85=\"\",\"\",Input!F85)","v":""},{"$f":"IF( Input!G85=\"\",\"\",Input!G85)","v":""},{"$f":"IF( Input!F85=\"\",\"\",Input!F85*Input!Y85+Input!Z85)","v":""},{"$f":"IF( Input!H85=\"\",\"\",Input!H85)","v":""},{"$f":"IF( Input!I85=\"\",\"\",Input!I85)","v":""},{"$f":"IF( Input!AH85=\"\",\"\",Input!AH85)","v":""},{"$f":"IF( Input!AF85=\"\",\"\",Input!AF85)","v":""},{"$f":"IF( Input!L85=\"\",\"\",Input!L85)","v":""},{"$f":"IF( Input!N85=\"\",\"\",Input!N85)","v":""},{"$f":"IF( Input!O85=\"\",\"\",Input!O85)","v":""},{"$f":"IF( Input!P85=\"\",\"\",Input!P85)","v":""},{"$f":"IF( Input!O85=\"\",\"\",Input!O85*Input!AL85+Input!AM85)","v":""},{"$f":"IF( Input!Q85=\"\",\"\",Input!Q85)","v":""},{"$f":"IF( Input!R85=\"\",\"\",Input!R85)","v":""},{"$f":"IF( Input!AU85=\"\",\"\",Input!AU85)","v":""},{"$f":"IF( Input!AS85=\"\",\"\",Input!AS85)","v":""},{"$f":"IF( Input!BB85=\"\",\"\",Input!BB85)","v":""},{"$f":"IF(Input!AY85=\"\",\"\",Input!AY85)","v":""},{"$f":"IF(Input!AZ85=\"\",\"\",Input!AZ85)","v":""},null,{"$f":"IF(Input!AR85=\"\",\"\",Input!AR85)","v":""},{"$f":"IF(Input!B85=\"\",\"\",(Input!AN85*Input!AP85+Input!AO85*Input!AQ85)/SUM(Input!AN85:AO85))","v":""},{"$f":"IF(Input!K85=\"\",\"\",Input!K85)","v":""},{"$f":"IF(Input!A85=\"\",\"\",Input!A85)","v":""},{"$f":"IF(Input!AT85=\"\",\"\",Input!AT85)","v":""},{"$f":"IF(Input!BC85=\"\",\"\",Input!BC85)","v":""},{"$f":"IF(Input!BD85=\"\",\"\",Input!BD85)","v":""},{"$f":"IF(Input!BG85=\"\",\"\",Input!BG85)","v":""},{"$f":"IF(Input!AX85=\"\",\"\",Input!AX85)","v":""},{"$f":"IF(Input!V85=\"\",\"\",Input!V85)","v":""}]
["",{"$f":"IF( Input!B86=\"\",\"\",Input!B86)","v":""},{"$f":"IF( Input!C86=\"\",\"\",Input!C86)","v":""},{"$f":"IF( Input!E86=\"\",\"\",Input!E86)","v":""},{"$f":"IF( Input!F86=\"\",\"\",Input!F86)","v":""},{"$f":"IF( Input!G86=\"\",\"\",Input!G86)","v":""},{"$f":"IF( Input!F86=\"\",\"\",Input!F86*Input!Y86+Input!Z86)","v":""},{"$f":"IF( Input!H86=\"\",\"\",Input!H86)","v":""},{"$f":"IF( Input!I86=\"\",\"\",Input!I86)","v":""},{"$f":"IF( Input!AH86=\"\",\"\",Input!AH86)","v":""},{"$f":"IF( Input!AF86=\"\",\"\",Input!AF86)","v":""},{"$f":"IF( Input!L86=\"\",\"\",Input!L86)","v":""},{"$f":"IF( Input!N86=\"\",\"\",Input!N86)","v":""},{"$f":"IF( Input!O86=\"\",\"\",Input!O86)","v":""},{"$f":"IF( Input!P86=\"\",\"\",Input!P86)","v":""},{"$f":"IF( Input!O86=\"\",\"\",Input!O86*Input!AL86+Input!AM86)","v":""},{"$f":"IF( Input!Q86=\"\",\"\",Input!Q86)","v":""},{"$f":"IF( Input!R86=\"\",\"\",Input!R86)","v":""},{"$f":"IF( Input!AU86=\"\",\"\",Input!AU86)","v":""},{"$f":"IF( Input!AS86=\"\",\"\",Input!AS86)","v":""},{"$f":"IF( Input!BB86=\"\",\"\",Input!BB86)","v":""},{"$f":"IF(Input!AY86=\"\",\"\",Input!AY86)","v":""},{"$f":"IF(Input!AZ86=\"\",\"\",Input!AZ86)","v":""},null,{"$f":"IF(Input!AR86=\"\",\"\",Input!AR86)","v":""},{"$f":"IF(Input!B86=\"\",\"\",(Input!AN86*Input!AP86+Input!AO86*Input!AQ86)/SUM(Input!AN86:AO86))","v":""},{"$f":"IF(Input!K86=\"\",\"\",Input!K86)","v":""},{"$f":"IF(Input!A86=\"\",\"\",Input!A86)","v":""},{"$f":"IF(Input!AT86=\"\",\"\",Input!AT86)","v":""},{"$f":"IF(Input!BC86=\"\",\"\",Input!BC86)","v":""},{"$f":"IF(Input!BD86=\"\",\"\",Input!BD86)","v":""},{"$f":"IF(Input!BG86=\"\",\"\",Input!BG86)","v":""},{"$f":"IF(Input!AX86=\"\",\"\",Input!AX86)","v":""},{"$f":"IF(Input!V86=\"\",\"\",Input!V86)","v":""}]
["",{"$f":"IF( Input!B87=\"\",\"\",Input!B87)","v":""},{"$f":"IF( Input!C87=\"\",\"\",Input!C87)","v":""},{"$f":"IF( Input!E87=\"\",\"\",Input!E87)","v":""},{"$f":"IF( Input!F87=\"\",\"\",Input!F87)","v":""},{"$f":"IF( Input!G87=\"\",\"\",Input!G87)","v":""},{"$f":"IF( Input!F87=\"\",\"\",Input!F87*Input!Y87+Input!Z87)","v":""},{"$f":"IF( Input!H87=\"\",\"\",Input!H87)","v":""},{"$f":"IF( Input!I87=\"\",\"\",Input!I87)","v":""},{"$f":"IF( Input!AH87=\"\",\"\",Input!AH87)","v":""},{"$f":"IF( Input!AF87=\"\",\"\",Input!AF87)","v":""},{"$f":"IF( Input!L87=\"\",\"\",Input!L87)","v":""},{"$f":"IF( Input!N87=\"\",\"\",Input!N87)","v":""},{"$f":"IF( Input!O87=\"\",\"\",Input!O87)","v":""},{"$f":"IF( Input!P87=\"\",\"\",Input!P87)","v":""},{"$f":"IF( Input!O87=\"\",\"\",Input!O87*Input!AL87+Input!AM87)","v":""},{"$f":"IF( Input!Q87=\"\",\"\",Input!Q87)","v":""},{"$f":"IF( Input!R87=\"\",\"\",Input!R87)","v":""},{"$f":"IF( Input!AU87=\"\",\"\",Input!AU87)","v":""},{"$f":"IF( Input!AS87=\"\",\"\",Input!AS87)","v":""},{"$f":"IF( Input!BB87=\"\",\"\",Input!BB87)","v":""},{"$f":"IF(Input!AY87=\"\",\"\",Input!AY87)","v":""},{"$f":"IF(Input!AZ87=\"\",\"\",Input!AZ87)","v":""},null,{"$f":"IF(Input!AR87=\"\",\"\",Input!AR87)","v":""},{"$f":"IF(Input!B87=\"\",\"\",(Input!AN87*Input!AP87+Input!AO87*Input!AQ87)/SUM(Input!AN87:AO87))","v":""},{"$f":"IF(Input!K87=\"\",\"\",Input!K87)","v":""},{"$f":"IF(Input!A87=\"\",\"\",Input!A87)","v":""},{"$f":"IF(Input!AT87=\"\",\"\",Input!AT87)","v":""},{"$f":"IF(Input!BC87=\"\",\"\",Input!BC87)","v":""},{"$f":"IF(Input!BD87=\"\",\"\",Input!BD87)","v":""},{"$f":"IF(Input!BG87=\"\",\"\",Input!BG87)","v":""},{"$f":"IF(Input!AX87=\"\",\"\",Input!AX87)","v":""},{"$f":"IF(Input!V87=\"\",\"\",Input!V87)","v":""}]
["",{"$f":"IF( Input!B88=\"\",\"\",Input!B88)","v":""},{"$f":"IF( Input!C88=\"\",\"\",Input!C88)","v":""},{"$f":"IF( Input!E88=\"\",\"\",Input!E88)","v":""},{"$f":"IF( Input!F88=\"\",\"\",Input!F88)","v":""},{"$f":"IF( Input!G88=\"\",\"\",Input!G88)","v":""},{"$f":"IF( Input!F88=\"\",\"\",Input!F88*Input!Y88+Input!Z88)","v":""},{"$f":"IF( Input!H88=\"\",\"\",Input!H88)","v":""},{"$f":"IF( Input!I88=\"\",\"\",Input!I88)","v":""},{"$f":"IF( Input!AH88=\"\",\"\",Input!AH88)","v":""},{"$f":"IF( Input!AF88=\"\",\"\",Input!AF88)","v":""},{"$f":"IF( Input!L88=\"\",\"\",Input!L88)","v":""},{"$f":"IF( Input!N88=\"\",\"\",Input!N88)","v":""},{"$f":"IF( Input!O88=\"\",\"\",Input!O88)","v":""},{"$f":"IF( Input!P88=\"\",\"\",Input!P88)","v":""},{"$f":"IF( Input!O88=\"\",\"\",Input!O88*Input!AL88+Input!AM88)","v":""},{"$f":"IF( Input!Q88=\"\",\"\",Input!Q88)","v":""},{"$f":"IF( Input!R88=\"\",\"\",Input!R88)","v":""},{"$f":"IF( Input!AU88=\"\",\"\",Input!AU88)","v":""},{"$f":"IF( Input!AS88=\"\",\"\",Input!AS88)","v":""},{"$f":"IF( Input!BB88=\"\",\"\",Input!BB88)","v":""},{"$f":"IF(Input!AY88=\"\",\"\",Input!AY88)","v":""},{"$f":"IF(Input!AZ88=\"\",\"\",Input!AZ88)","v":""},null,{"$f":"IF(Input!AR88=\"\",\"\",Input!AR88)","v":""},{"$f":"IF(Input!B88=\"\",\"\",(Input!AN88*Input!AP88+Input!AO88*Input!AQ88)/SUM(Input!AN88:AO88))","v":""},{"$f":"IF(Input!K88=\"\",\"\",Input!K88)","v":""},{"$f":"IF(Input!A88=\"\",\"\",Input!A88)","v":""},{"$f":"IF(Input!AT88=\"\",\"\",Input!AT88)","v":""},{"$f":"IF(Input!BC88=\"\",\"\",Input!BC88)","v":""},{"$f":"IF(Input!BD88=\"\",\"\",Input!BD88)","v":""},{"$f":"IF(Input!BG88=\"\",\"\",Input!BG88)","v":""},{"$f":"IF(Input!AX88=\"\",\"\",Input!AX88)","v":""},{"$f":"IF(Input!V88=\"\",\"\",Input!V88)","v":""}]
["",{"$f":"IF( Input!B89=\"\",\"\",Input!B89)","v":""},{"$f":"IF( Input!C89=\"\",\"\",Input!C89)","v":""},{"$f":"IF( Input!E89=\"\",\"\",Input!E89)","v":""},{"$f":"IF( Input!F89=\"\",\"\",Input!F89)","v":""},{"$f":"IF( Input!G89=\"\",\"\",Input!G89)","v":""},{"$f":"IF( Input!F89=\"\",\"\",Input!F89*Input!Y89+Input!Z89)","v":""},{"$f":"IF( Input!H89=\"\",\"\",Input!H89)","v":""},{"$f":"IF( Input!I89=\"\",\"\",Input!I89)","v":""},{"$f":"IF( Input!AH89=\"\",\"\",Input!AH89)","v":""},{"$f":"IF( Input!AF89=\"\",\"\",Input!AF89)","v":""},{"$f":"IF( Input!L89=\"\",\"\",Input!L89)","v":""},{"$f":"IF( Input!N89=\"\",\"\",Input!N89)","v":""},{"$f":"IF( Input!O89=\"\",\"\",Input!O89)","v":""},{"$f":"IF( Input!P89=\"\",\"\",Input!P89)","v":""},{"$f":"IF( Input!O89=\"\",\"\",Input!O89*Input!AL89+Input!AM89)","v":""},{"$f":"IF( Input!Q89=\"\",\"\",Input!Q89)","v":""},{"$f":"IF( Input!R89=\"\",\"\",Input!R89)","v":""},{"$f":"IF( Input!AU89=\"\",\"\",Input!AU89)","v":""},{"$f":"IF( Input!AS89=\"\",\"\",Input!AS89)","v":""},{"$f":"IF( Input!BB89=\"\",\"\",Input!BB89)","v":""},{"$f":"IF(Input!AY89=\"\",\"\",Input!AY89)","v":""},{"$f":"IF(Input!AZ89=\"\",\"\",Input!AZ89)","v":""},null,{"$f":"IF(Input!AR89=\"\",\"\",Input!AR89)","v":""},{"$f":"IF(Input!B89=\"\",\"\",(Input!AN89*Input!AP89+Input!AO89*Input!AQ89)/SUM(Input!AN89:AO89))","v":""},{"$f":"IF(Input!K89=\"\",\"\",Input!K89)","v":""},{"$f":"IF(Input!A89=\"\",\"\",Input!A89)","v":""},{"$f":"IF(Input!AT89=\"\",\"\",Input!AT89)","v":""},{"$f":"IF(Input!BC89=\"\",\"\",Input!BC89)","v":""},{"$f":"IF(Input!BD89=\"\",\"\",Input!BD89)","v":""},{"$f":"IF(Input!BG89=\"\",\"\",Input!BG89)","v":""},{"$f":"IF(Input!AX89=\"\",\"\",Input!AX89)","v":""},{"$f":"IF(Input!V89=\"\",\"\",Input!V89)","v":""}]
["",{"$f":"IF( Input!B90=\"\",\"\",Input!B90)","v":""},{"$f":"IF( Input!C90=\"\",\"\",Input!C90)","v":""},{"$f":"IF( Input!E90=\"\",\"\",Input!E90)","v":""},{"$f":"IF( Input!F90=\"\",\"\",Input!F90)","v":""},{"$f":"IF( Input!G90=\"\",\"\",Input!G90)","v":""},{"$f":"IF( Input!F90=\"\",\"\",Input!F90*Input!Y90+Input!Z90)","v":""},{"$f":"IF( Input!H90=\"\",\"\",Input!H90)","v":""},{"$f":"IF( Input!I90=\"\",\"\",Input!I90)","v":""},{"$f":"IF( Input!AH90=\"\",\"\",Input!AH90)","v":""},{"$f":"IF( Input!AF90=\"\",\"\",Input!AF90)","v":""},{"$f":"IF( Input!L90=\"\",\"\",Input!L90)","v":""},{"$f":"IF( Input!N90=\"\",\"\",Input!N90)","v":""},{"$f":"IF( Input!O90=\"\",\"\",Input!O90)","v":""},{"$f":"IF( Input!P90=\"\",\"\",Input!P90)","v":""},{"$f":"IF( Input!O90=\"\",\"\",Input!O90*Input!AL90+Input!AM90)","v":""},{"$f":"IF( Input!Q90=\"\",\"\",Input!Q90)","v":""},{"$f":"IF( Input!R90=\"\",\"\",Input!R90)","v":""},{"$f":"IF( Input!AU90=\"\",\"\",Input!AU90)","v":""},{"$f":"IF( Input!AS90=\"\",\"\",Input!AS90)","v":""},{"$f":"IF( Input!BB90=\"\",\"\",Input!BB90)","v":""},{"$f":"IF(Input!AY90=\"\",\"\",Input!AY90)","v":""},{"$f":"IF(Input!AZ90=\"\",\"\",Input!AZ90)","v":""},null,{"$f":"IF(Input!AR90=\"\",\"\",Input!AR90)","v":""},{"$f":"IF(Input!B90=\"\",\"\",(Input!AN90*Input!AP90+Input!AO90*Input!AQ90)/SUM(Input!AN90:AO90))","v":""},{"$f":"IF(Input!K90=\"\",\"\",Input!K90)","v":""},{"$f":"IF(Input!A90=\"\",\"\",Input!A90)","v":""},{"$f":"IF(Input!AT90=\"\",\"\",Input!AT90)","v":""},{"$f":"IF(Input!BC90=\"\",\"\",Input!BC90)","v":""},{"$f":"IF(Input!BD90=\"\",\"\",Input!BD90)","v":""},{"$f":"IF(Input!BG90=\"\",\"\",Input!BG90)","v":""},{"$f":"IF(Input!AX90=\"\",\"\",Input!AX90)","v":""},{"$f":"IF(Input!V90=\"\",\"\",Input!V90)","v":""}]
["",{"$f":"IF( Input!B91=\"\",\"\",Input!B91)","v":""},{"$f":"IF( Input!C91=\"\",\"\",Input!C91)","v":""},{"$f":"IF( Input!E91=\"\",\"\",Input!E91)","v":""},{"$f":"IF( Input!F91=\"\",\"\",Input!F91)","v":""},{"$f":"IF( Input!G91=\"\",\"\",Input!G91)","v":""},{"$f":"IF( Input!F91=\"\",\"\",Input!F91*Input!Y91+Input!Z91)","v":""},{"$f":"IF( Input!H91=\"\",\"\",Input!H91)","v":""},{"$f":"IF( Input!I91=\"\",\"\",Input!I91)","v":""},{"$f":"IF( Input!AH91=\"\",\"\",Input!AH91)","v":""},{"$f":"IF( Input!AF91=\"\",\"\",Input!AF91)","v":""},{"$f":"IF( Input!L91=\"\",\"\",Input!L91)","v":""},{"$f":"IF( Input!N91=\"\",\"\",Input!N91)","v":""},{"$f":"IF( Input!O91=\"\",\"\",Input!O91)","v":""},{"$f":"IF( Input!P91=\"\",\"\",Input!P91)","v":""},{"$f":"IF( Input!O91=\"\",\"\",Input!O91*Input!AL91+Input!AM91)","v":""},{"$f":"IF( Input!Q91=\"\",\"\",Input!Q91)","v":""},{"$f":"IF( Input!R91=\"\",\"\",Input!R91)","v":""},{"$f":"IF( Input!AU91=\"\",\"\",Input!AU91)","v":""},{"$f":"IF( Input!AS91=\"\",\"\",Input!AS91)","v":""},{"$f":"IF( Input!BB91=\"\",\"\",Input!BB91)","v":""},{"$f":"IF(Input!AY91=\"\",\"\",Input!AY91)","v":""},{"$f":"IF(Input!AZ91=\"\",\"\",Input!AZ91)","v":""},null,{"$f":"IF(Input!AR91=\"\",\"\",Input!AR91)","v":""},{"$f":"IF(Input!B91=\"\",\"\",(Input!AN91*Input!AP91+Input!AO91*Input!AQ91)/SUM(Input!AN91:AO91))","v":""},{"$f":"IF(Input!K91=\"\",\"\",Input!K91)","v":""},{"$f":"IF(Input!A91=\"\",\"\",Input!A91)","v":""},{"$f":"IF(Input!AT91=\"\",\"\",Input!AT91)","v":""},{"$f":"IF(Input!BC91=\"\",\"\",Input!BC91)","v":""},{"$f":"IF(Input!BD91=\"\",\"\",Input!BD91)","v":""},{"$f":"IF(Input!BG91=\"\",\"\",Input!BG91)","v":""},{"$f":"IF(Input!AX91=\"\",\"\",Input!AX91)","v":""},{"$f":"IF(Input!V91=\"\",\"\",Input!V91)","v":""}]
["",{"$f":"IF( Input!B92=\"\",\"\",Input!B92)","v":""},{"$f":"IF( Input!C92=\"\",\"\",Input!C92)","v":""},{"$f":"IF( Input!E92=\"\",\"\",Input!E92)","v":""},{"$f":"IF( Input!F92=\"\",\"\",Input!F92)","v":""},{"$f":"IF( Input!G92=\"\",\"\",Input!G92)","v":""},{"$f":"IF( Input!F92=\"\",\"\",Input!F92*Input!Y92+Input!Z92)","v":""},{"$f":"IF( Input!H92=\"\",\"\",Input!H92)","v":""},{"$f":"IF( Input!I92=\"\",\"\",Input!I92)","v":""},{"$f":"IF( Input!AH92=\"\",\"\",Input!AH92)","v":""},{"$f":"IF( Input!AF92=\"\",\"\",Input!AF92)","v":""},{"$f":"IF( Input!L92=\"\",\"\",Input!L92)","v":""},{"$f":"IF( Input!N92=\"\",\"\",Input!N92)","v":""},{"$f":"IF( Input!O92=\"\",\"\",Input!O92)","v":""},{"$f":"IF( Input!P92=\"\",\"\",Input!P92)","v":""},{"$f":"IF( Input!O92=\"\",\"\",Input!O92*Input!AL92+Input!AM92)","v":""},{"$f":"IF( Input!Q92=\"\",\"\",Input!Q92)","v":""},{"$f":"IF( Input!R92=\"\",\"\",Input!R92)","v":""},{"$f":"IF( Input!AU92=\"\",\"\",Input!AU92)","v":""},{"$f":"IF( Input!AS92=\"\",\"\",Input!AS92)","v":""},{"$f":"IF( Input!BB92=\"\",\"\",Input!BB92)","v":""},{"$f":"IF(Input!AY92=\"\",\"\",Input!AY92)","v":""},{"$f":"IF(Input!AZ92=\"\",\"\",Input!AZ92)","v":""},null,{"$f":"IF(Input!AR92=\"\",\"\",Input!AR92)","v":""},{"$f":"IF(Input!B92=\"\",\"\",(Input!AN92*Input!AP92+Input!AO92*Input!AQ92)/SUM(Input!AN92:AO92))","v":""},{"$f":"IF(Input!K92=\"\",\"\",Input!K92)","v":""},{"$f":"IF(Input!A92=\"\",\"\",Input!A92)","v":""},{"$f":"IF(Input!AT92=\"\",\"\",Input!AT92)","v":""},{"$f":"IF(Input!BC92=\"\",\"\",Input!BC92)","v":""},{"$f":"IF(Input!BD92=\"\",\"\",Input!BD92)","v":""},{"$f":"IF(Input!BG92=\"\",\"\",Input!BG92)","v":""},{"$f":"IF(Input!AX92=\"\",\"\",Input!AX92)","v":""},{"$f":"IF(Input!V92=\"\",\"\",Input!V92)","v":""}]
["",{"$f":"IF( Input!B93=\"\",\"\",Input!B93)","v":""},{"$f":"IF( Input!C93=\"\",\"\",Input!C93)","v":""},{"$f":"IF( Input!E93=\"\",\"\",Input!E93)","v":""},{"$f":"IF( Input!F93=\"\",\"\",Input!F93)","v":""},{"$f":"IF( Input!G93=\"\",\"\",Input!G93)","v":""},{"$f":"IF( Input!F93=\"\",\"\",Input!F93*Input!Y93+Input!Z93)","v":""},{"$f":"IF( Input!H93=\"\",\"\",Input!H93)","v":""},{"$f":"IF( Input!I93=\"\",\"\",Input!I93)","v":""},{"$f":"IF( Input!AH93=\"\",\"\",Input!AH93)","v":""},{"$f":"IF( Input!AF93=\"\",\"\",Input!AF93)","v":""},{"$f":"IF( Input!L93=\"\",\"\",Input!L93)","v":""},{"$f":"IF( Input!N93=\"\",\"\",Input!N93)","v":""},{"$f":"IF( Input!O93=\"\",\"\",Input!O93)","v":""},{"$f":"IF( Input!P93=\"\",\"\",Input!P93)","v":""},{"$f":"IF( Input!O93=\"\",\"\",Input!O93*Input!AL93+Input!AM93)","v":""},{"$f":"IF( Input!Q93=\"\",\"\",Input!Q93)","v":""},{"$f":"IF( Input!R93=\"\",\"\",Input!R93)","v":""},{"$f":"IF( Input!AU93=\"\",\"\",Input!AU93)","v":""},{"$f":"IF( Input!AS93=\"\",\"\",Input!AS93)","v":""},{"$f":"IF( Input!BB93=\"\",\"\",Input!BB93)","v":""},{"$f":"IF(Input!AY93=\"\",\"\",Input!AY93)","v":""},{"$f":"IF(Input!AZ93=\"\",\"\",Input!AZ93)","v":""},null,{"$f":"IF(Input!AR93=\"\",\"\",Input!AR93)","v":""},{"$f":"IF(Input!B93=\"\",\"\",(Input!AN93*Input!AP93+Input!AO93*Input!AQ93)/SUM(Input!AN93:AO93))","v":""},{"$f":"IF(Input!K93=\"\",\"\",Input!K93)","v":""},{"$f":"IF(Input!A93=\"\",\"\",Input!A93)","v":""},{"$f":"IF(Input!AT93=\"\",\"\",Input!AT93)","v":""},{"$f":"IF(Input!BC93=\"\",\"\",Input!BC93)","v":""},{"$f":"IF(Input!BD93=\"\",\"\",Input!BD93)","v":""},{"$f":"IF(Input!BG93=\"\",\"\",Input!BG93)","v":""},{"$f":"IF(Input!AX93=\"\",\"\",Input!AX93)","v":""},{"$f":"IF(Input!V93=\"\",\"\",Input!V93)","v":""}]
["",{"$f":"IF( Input!B94=\"\",\"\",Input!B94)","v":""},{"$f":"IF( Input!C94=\"\",\"\",Input!C94)","v":""},{"$f":"IF( Input!E94=\"\",\"\",Input!E94)","v":""},{"$f":"IF( Input!F94=\"\",\"\",Input!F94)","v":""},{"$f":"IF( Input!G94=\"\",\"\",Input!G94)","v":""},{"$f":"IF( Input!F94=\"\",\"\",Input!F94*Input!Y94+Input!Z94)","v":""},{"$f":"IF( Input!H94=\"\",\"\",Input!H94)","v":""},{"$f":"IF( Input!I94=\"\",\"\",Input!I94)","v":""},{"$f":"IF( Input!AH94=\"\",\"\",Input!AH94)","v":""},{"$f":"IF( Input!AF94=\"\",\"\",Input!AF94)","v":""},{"$f":"IF( Input!L94=\"\",\"\",Input!L94)","v":""},{"$f":"IF( Input!N94=\"\",\"\",Input!N94)","v":""},{"$f":"IF( Input!O94=\"\",\"\",Input!O94)","v":""},{"$f":"IF( Input!P94=\"\",\"\",Input!P94)","v":""},{"$f":"IF( Input!O94=\"\",\"\",Input!O94*Input!AL94+Input!AM94)","v":""},{"$f":"IF( Input!Q94=\"\",\"\",Input!Q94)","v":""},{"$f":"IF( Input!R94=\"\",\"\",Input!R94)","v":""},{"$f":"IF( Input!AU94=\"\",\"\",Input!AU94)","v":""},{"$f":"IF( Input!AS94=\"\",\"\",Input!AS94)","v":""},{"$f":"IF( Input!BB94=\"\",\"\",Input!BB94)","v":""},{"$f":"IF(Input!AY94=\"\",\"\",Input!AY94)","v":""},{"$f":"IF(Input!AZ94=\"\",\"\",Input!AZ94)","v":""},null,{"$f":"IF(Input!AR94=\"\",\"\",Input!AR94)","v":""},{"$f":"IF(Input!B94=\"\",\"\",(Input!AN94*Input!AP94+Input!AO94*Input!AQ94)/SUM(Input!AN94:AO94))","v":""},{"$f":"IF(Input!K94=\"\",\"\",Input!K94)","v":""},{"$f":"IF(Input!A94=\"\",\"\",Input!A94)","v":""},{"$f":"IF(Input!AT94=\"\",\"\",Input!AT94)","v":""},{"$f":"IF(Input!BC94=\"\",\"\",Input!BC94)","v":""},{"$f":"IF(Input!BD94=\"\",\"\",Input!BD94)","v":""},{"$f":"IF(Input!BG94=\"\",\"\",Input!BG94)","v":""},{"$f":"IF(Input!AX94=\"\",\"\",Input!AX94)","v":""},{"$f":"IF(Input!V94=\"\",\"\",Input!V94)","v":""}]
["",{"$f":"IF( Input!B95=\"\",\"\",Input!B95)","v":""},{"$f":"IF( Input!C95=\"\",\"\",Input!C95)","v":""},{"$f":"IF( Input!E95=\"\",\"\",Input!E95)","v":""},{"$f":"IF( Input!F95=\"\",\"\",Input!F95)","v":""},{"$f":"IF( Input!G95=\"\",\"\",Input!G95)","v":""},{"$f":"IF( Input!F95=\"\",\"\",Input!F95*Input!Y95+Input!Z95)","v":""},{"$f":"IF( Input!H95=\"\",\"\",Input!H95)","v":""},{"$f":"IF( Input!I95=\"\",\"\",Input!I95)","v":""},{"$f":"IF( Input!AH95=\"\",\"\",Input!AH95)","v":""},{"$f":"IF( Input!AF95=\"\",\"\",Input!AF95)","v":""},{"$f":"IF( Input!L95=\"\",\"\",Input!L95)","v":""},{"$f":"IF( Input!N95=\"\",\"\",Input!N95)","v":""},{"$f":"IF( Input!O95=\"\",\"\",Input!O95)","v":""},{"$f":"IF( Input!P95=\"\",\"\",Input!P95)","v":""},{"$f":"IF( Input!O95=\"\",\"\",Input!O95*Input!AL95+Input!AM95)","v":""},{"$f":"IF( Input!Q95=\"\",\"\",Input!Q95)","v":""},{"$f":"IF( Input!R95=\"\",\"\",Input!R95)","v":""},{"$f":"IF( Input!AU95=\"\",\"\",Input!AU95)","v":""},{"$f":"IF( Input!AS95=\"\",\"\",Input!AS95)","v":""},{"$f":"IF( Input!BB95=\"\",\"\",Input!BB95)","v":""},{"$f":"IF(Input!AY95=\"\",\"\",Input!AY95)","v":""},{"$f":"IF(Input!AZ95=\"\",\"\",Input!AZ95)","v":""},null,{"$f":"IF(Input!AR95=\"\",\"\",Input!AR95)","v":""},{"$f":"IF(Input!B95=\"\",\"\",(Input!AN95*Input!AP95+Input!AO95*Input!AQ95)/SUM(Input!AN95:AO95))","v":""},{"$f":"IF(Input!K95=\"\",\"\",Input!K95)","v":""},{"$f":"IF(Input!A95=\"\",\"\",Input!A95)","v":""},{"$f":"IF(Input!AT95=\"\",\"\",Input!AT95)","v":""},{"$f":"IF(Input!BC95=\"\",\"\",Input!BC95)","v":""},{"$f":"IF(Input!BD95=\"\",\"\",Input!BD95)","v":""},{"$f":"IF(Input!BG95=\"\",\"\",Input!BG95)","v":""},{"$f":"IF(Input!AX95=\"\",\"\",Input!AX95)","v":""},{"$f":"IF(Input!V95=\"\",\"\",Input!V95)","v":""}]
["",{"$f":"IF( Input!B96=\"\",\"\",Input!B96)","v":""},{"$f":"IF( Input!C96=\"\",\"\",Input!C96)","v":""},{"$f":"IF( Input!E96=\"\",\"\",Input!E96)","v":""},{"$f":"IF( Input!F96=\"\",\"\",Input!F96)","v":""},{"$f":"IF( Input!G96=\"\",\"\",Input!G96)","v":""},{"$f":"IF( Input!F96=\"\",\"\",Input!F96*Input!Y96+Input!Z96)","v":""},{"$f":"IF( Input!H96=\"\",\"\",Input!H96)","v":""},{"$f":"IF( Input!I96=\"\",\"\",Input!I96)","v":""},{"$f":"IF( Input!AH96=\"\",\"\",Input!AH96)","v":""},{"$f":"IF( Input!AF96=\"\",\"\",Input!AF96)","v":""},{"$f":"IF( Input!L96=\"\",\"\",Input!L96)","v":""},{"$f":"IF( Input!N96=\"\",\"\",Input!N96)","v":""},{"$f":"IF( Input!O96=\"\",\"\",Input!O96)","v":""},{"$f":"IF( Input!P96=\"\",\"\",Input!P96)","v":""},{"$f":"IF( Input!O96=\"\",\"\",Input!O96*Input!AL96+Input!AM96)","v":""},{"$f":"IF( Input!Q96=\"\",\"\",Input!Q96)","v":""},{"$f":"IF( Input!R96=\"\",\"\",Input!R96)","v":""},{"$f":"IF( Input!AU96=\"\",\"\",Input!AU96)","v":""},{"$f":"IF( Input!AS96=\"\",\"\",Input!AS96)","v":""},{"$f":"IF( Input!BB96=\"\",\"\",Input!BB96)","v":""},{"$f":"IF(Input!AY96=\"\",\"\",Input!AY96)","v":""},{"$f":"IF(Input!AZ96=\"\",\"\",Input!AZ96)","v":""},null,{"$f":"IF(Input!AR96=\"\",\"\",Input!AR96)","v":""},{"$f":"IF(Input!B96=\"\",\"\",(Input!AN96*Input!AP96+Input!AO96*Input!AQ96)/SUM(Input!AN96:AO96))","v":""},{"$f":"IF(Input!K96=\"\",\"\",Input!K96)","v":""},{"$f":"IF(Input!A96=\"\",\"\",Input!A96)","v":""},{"$f":"IF(Input!AT96=\"\",\"\",Input!AT96)","v":""},{"$f":"IF(Input!BC96=\"\",\"\",Input!BC96)","v":""},{"$f":"IF(Input!BD96=\"\",\"\",Input!BD96)","v":""},{"$f":"IF(Input!BG96=\"\",\"\",Input!BG96)","v":""},{"$f":"IF(Input!AX96=\"\",\"\",Input!AX96)","v":""},{"$f":"IF(Input!V96=\"\",\"\",Input!V96)","v":""}]
["",{"$f":"IF( Input!B97=\"\",\"\",Input!B97)","v":""},{"$f":"IF( Input!C97=\"\",\"\",Input!C97)","v":""},{"$f":"IF( Input!E97=\"\",\"\",Input!E97)","v":""},{"$f":"IF( Input!F97=\"\",\"\",Input!F97)","v":""},{"$f":"IF( Input!G97=\"\",\"\",Input!G97)","v":""},{"$f":"IF( Input!F97=\"\",\"\",Input!F97*Input!Y97+Input!Z97)","v":""},{"$f":"IF( Input!H97=\"\",\"\",Input!H97)","v":""},{"$f":"IF( Input!I97=\"\",\"\",Input!I97)","v":""},{"$f":"IF( Input!AH97=\"\",\"\",Input!AH97)","v":""},{"$f":"IF( Input!AF97=\"\",\"\",Input!AF97)","v":""},{"$f":"IF( Input!L97=\"\",\"\",Input!L97)","v":""},{"$f":"IF( Input!N97=\"\",\"\",Input!N97)","v":""},{"$f":"IF( Input!O97=\"\",\"\",Input!O97)","v":""},{"$f":"IF( Input!P97=\"\",\"\",Input!P97)","v":""},{"$f":"IF( Input!O97=\"\",\"\",Input!O97*Input!AL97+Input!AM97)","v":""},{"$f":"IF( Input!Q97=\"\",\"\",Input!Q97)","v":""},{"$f":"IF( Input!R97=\"\",\"\",Input!R97)","v":""},{"$f":"IF( Input!AU97=\"\",\"\",Input!AU97)","v":""},{"$f":"IF( Input!AS97=\"\",\"\",Input!AS97)","v":""},{"$f":"IF( Input!BB97=\"\",\"\",Input!BB97)","v":""},{"$f":"IF(Input!AY97=\"\",\"\",Input!AY97)","v":""},{"$f":"IF(Input!AZ97=\"\",\"\",Input!AZ97)","v":""},null,{"$f":"IF(Input!AR97=\"\",\"\",Input!AR97)","v":""},{"$f":"IF(Input!B97=\"\",\"\",(Input!AN97*Input!AP97+Input!AO97*Input!AQ97)/SUM(Input!AN97:AO97))","v":""},{"$f":"IF(Input!K97=\"\",\"\",Input!K97)","v":""},{"$f":"IF(Input!A97=\"\",\"\",Input!A97)","v":""},{"$f":"IF(Input!AT97=\"\",\"\",Input!AT97)","v":""},{"$f":"IF(Input!BC97=\"\",\"\",Input!BC97)","v":""},{"$f":"IF(Input!BD97=\"\",\"\",Input!BD97)","v":""},{"$f":"IF(Input!BG97=\"\",\"\",Input!BG97)","v":""},{"$f":"IF(Input!AX97=\"\",\"\",Input!AX97)","v":""},{"$f":"IF(Input!V97=\"\",\"\",Input!V97)","v":""}]
["",{"$f":"IF( Input!B98=\"\",\"\",Input!B98)","v":""},{"$f":"IF( Input!C98=\"\",\"\",Input!C98)","v":""},{"$f":"IF( Input!E98=\"\",\"\",Input!E98)","v":""},{"$f":"IF( Input!F98=\"\",\"\",Input!F98)","v":""},{"$f":"IF( Input!G98=\"\",\"\",Input!G98)","v":""},{"$f":"IF( Input!F98=\"\",\"\",Input!F98*Input!Y98+Input!Z98)","v":""},{"$f":"IF( Input!H98=\"\",\"\",Input!H98)","v":""},{"$f":"IF( Input!I98=\"\",\"\",Input!I98)","v":""},{"$f":"IF( Input!AH98=\"\",\"\",Input!AH98)","v":""},{"$f":"IF( Input!AF98=\"\",\"\",Input!AF98)","v":""},{"$f":"IF( Input!L98=\"\",\"\",Input!L98)","v":""},{"$f":"IF( Input!N98=\"\",\"\",Input!N98)","v":""},{"$f":"IF( Input!O98=\"\",\"\",Input!O98)","v":""},{"$f":"IF( Input!P98=\"\",\"\",Input!P98)","v":""},{"$f":"IF( Input!O98=\"\",\"\",Input!O98*Input!AL98+Input!AM98)","v":""},{"$f":"IF( Input!Q98=\"\",\"\",Input!Q98)","v":""},{"$f":"IF( Input!R98=\"\",\"\",Input!R98)","v":""},{"$f":"IF( Input!AU98=\"\",\"\",Input!AU98)","v":""},{"$f":"IF( Input!AS98=\"\",\"\",Input!AS98)","v":""},{"$f":"IF( Input!BB98=\"\",\"\",Input!BB98)","v":""},{"$f":"IF(Input!AY98=\"\",\"\",Input!AY98)","v":""},{"$f":"IF(Input!AZ98=\"\",\"\",Input!AZ98)","v":""},null,{"$f":"IF(Input!AR98=\"\",\"\",Input!AR98)","v":""},{"$f":"IF(Input!B98=\"\",\"\",(Input!AN98*Input!AP98+Input!AO98*Input!AQ98)/SUM(Input!AN98:AO98))","v":""},{"$f":"IF(Input!K98=\"\",\"\",Input!K98)","v":""},{"$f":"IF(Input!A98=\"\",\"\",Input!A98)","v":""},{"$f":"IF(Input!AT98=\"\",\"\",Input!AT98)","v":""},{"$f":"IF(Input!BC98=\"\",\"\",Input!BC98)","v":""},{"$f":"IF(Input!BD98=\"\",\"\",Input!BD98)","v":""},{"$f":"IF(Input!BG98=\"\",\"\",Input!BG98)","v":""},{"$f":"IF(Input!AX98=\"\",\"\",Input!AX98)","v":""},{"$f":"IF(Input!V98=\"\",\"\",Input!V98)","v":""}]
["",{"$f":"IF( Input!B99=\"\",\"\",Input!B99)","v":""},{"$f":"IF( Input!C99=\"\",\"\",Input!C99)","v":""},{"$f":"IF( Input!E99=\"\",\"\",Input!E99)","v":""},{"$f":"IF( Input!F99=\"\",\"\",Input!F99)","v":""},{"$f":"IF( Input!G99=\"\",\"\",Input!G99)","v":""},{"$f":"IF( Input!F99=\"\",\"\",Input!F99*Input!Y99+Input!Z99)","v":""},{"$f":"IF( Input!H99=\"\",\"\",Input!H99)","v":""},{"$f":"IF( Input!I99=\"\",\"\",Input!I99)","v":""},{"$f":"IF( Input!AH99=\"\",\"\",Input!AH99)","v":""},{"$f":"IF( Input!AF99=\"\",\"\",Input!AF99)","v":""},{"$f":"IF( Input!L99=\"\",\"\",Input!L99)","v":""},{"$f":"IF( Input!N99=\"\",\"\",Input!N99)","v":""},{"$f":"IF( Input!O99=\"\",\"\",Input!O99)","v":""},{"$f":"IF( Input!P99=\"\",\"\",Input!P99)","v":""},{"$f":"IF( Input!O99=\"\",\"\",Input!O99*Input!AL99+Input!AM99)","v":""},{"$f":"IF( Input!Q99=\"\",\"\",Input!Q99)","v":""},{"$f":"IF( Input!R99=\"\",\"\",Input!R99)","v":""},{"$f":"IF( Input!AU99=\"\",\"\",Input!AU99)","v":""},{"$f":"IF( Input!AS99=\"\",\"\",Input!AS99)","v":""},{"$f":"IF( Input!BB99=\"\",\"\",Input!BB99)","v":""},{"$f":"IF(Input!AY99=\"\",\"\",Input!AY99)","v":""},{"$f":"IF(Input!AZ99=\"\",\"\",Input!AZ99)","v":""},null,{"$f":"IF(Input!AR99=\"\",\"\",Input!AR99)","v":""},{"$f":"IF(Input!B99=\"\",\"\",(Input!AN99*Input!AP99+Input!AO99*Input!AQ99)/SUM(Input!AN99:AO99))","v":""},{"$f":"IF(Input!K99=\"\",\"\",Input!K99)","v":""},{"$f":"IF(Input!A99=\"\",\"\",Input!A99)","v":""},{"$f":"IF(Input!AT99=\"\",\"\",Input!AT99)","v":""},{"$f":"IF(Input!BC99=\"\",\"\",Input!BC99)","v":""},{"$f":"IF(Input!BD99=\"\",\"\",Input!BD99)","v":""},{"$f":"IF(Input!BG99=\"\",\"\",Input!BG99)","v":""},{"$f":"IF(Input!AX99=\"\",\"\",Input!AX99)","v":""},{"$f":"IF(Input!V99=\"\",\"\",Input!V99)","v":""}]
["END OF REPORT",null,null,null,null,null,null,null,null,{"$f":"IF( Input!AH100=\"\",\"\",Input!AH100)","v":""},null,null,null,null,null,null,null,null,null,"",""]