{"text_format":"1","workbook":"xlsx","n_sheets":6,"sheets":["FRONT PAGE","Input","Tables (3)","Tables","Summary","Report"],"not_rendered":{"charts":0,"images":14,"macros":1,"external_links":0,"defined_names":81,"comments":3,"pivot_tables":0},"unopened":[],"bounds":{"document_bytes":16777216,"sheet_cells":100000,"rows_first":2000,"rows_last":500,"rows_between":2000,"halvings":0,"cell_chars":16384,"cell_head_chars":4096},"cells_cut":0,"cells_raw":0,"read":"whole","date_system":"1900"}

{"sheet":"FRONT PAGE","index":0,"n_rows":38,"n_cols":7,"rows_kept":38,"cut":false,"hidden":false,"merged":[[18,2,22,8],[46,4,46,5],[46,6,46,7],[36,2,36,3],[30,6,33,8],[37,5,37,8]]}
[]
[]
[]
[]
[]
[]
[]
[null,null,"Commercial Lighting Calculation Tool v8.0"]
[null,null,"Published: 8 May 2023"]
[null,null,"Rule version: 14 April 2023"]
[]
[]
[]
[]
[]
{"$rows_left_out":24}
{"sheet":"Input","index":1,"n_rows":108,"n_cols":84,"rows_kept":108,"cut":false,"hidden":false,"merged":[[0,2,0,3],[4,11,4,18],[4,50,4,53],[4,41,4,42],[2,28,2,29],[4,26,4,27],[4,28,4,29],[4,39,4,40],[4,0,4,9]]}
[null,"End Application","Accreditation Date",null,"Imp Date","Nomination Date","Regional Network Factor","Implementation ID",null,null,null,null,null,null,null,null,null,null,null,null,null,null,null,null,null,null,{"$f":"C7*F7","v":0},{"$f":"(L7*(Y7-1)+Z7)*C7","v":{"$error":"#VALUE!"}}]
[null,3000]
[null,"Address"]
[1,2,3,4,5,6,7,8,9,10,11,12,13,14,15,16,17,18,19,20,21,22,23,24,25,26,27,28,29,30,31,32,33,34,35,36,37,38,39,40,41,42,43,44,45,46,47,48,49,50,51,52,53,54,55,56,57,58,59,60,61,62,65,67,69,71,73,75,77,"1900-03-19",81,83,85,87]
["Old Lighting Installation",null,null,null,null,null,null,null,null,null,null,"New lighting installation",null,null,null,null,null,null,null,null,null,null,null,null,null,null,"LCP ",null,"Lifetimes",null,null,null,null,null,null,null,null,null,null,"LCP",null,"Lifetimes",null,null,null,null,null,null,null,null,"LIFETIME SPECIFICATION PARAMETERS",null,null,null,null,null,null,null,null,null,null,"2012-01-01"]
["Space Group","Area","No. lamps","Lamps are outdoor","Lamp type","Nominal lamp power (W)","Ballast/ transformer type","Control system-1","Control system-2","Air conditioned space","Space Type","No. lamps",null,"Lamp type","Nominal lamp power (W)","Ballast/ transformer type","Control system-1","Control system-2","Air conditioned space","Date of Implementation","Baseline - Upgrade (MWh)","ESCs","Annual Operating Hours","Lamp & ballast/ transformer","M value","C value","Lamp (W)","Control Gear (W)","Lamp Lifetime (yrs)","Control Gear Lifetime (yrs)","Operating hrs/yr","CM","AM","LCP\nLow (W)","Energy 'Before' (MWh)",null,"Lamp & ballast/ transformer","M value","C value","Lamp Circuit Power (W)","Control Gear (W)","Lamp Lifetime (yrs)","Control Gear Lifetime (yrs)","Operating hrs/yr","CM","AM","LCP\nLow (W)","Energy 'After' (MWh)","Saving (MWh) Without RNF","Saving  (MWh) With RNF","Only Globes","Only Control System","Higher Power Replacement","Lifetime of Lamp","Brand","Model No","Supplier Code ","Easily Replaced (Not Reversible) ","Date Acceptance Letter","Accreditation Date ","Date of Approval","ESCs Vintage ","Project's Implementation Date ","Project Lifetime Factor","Total lifetime of the project (Days)","Project Lifetime","Entitlement Date ","Effective Start Date","Effective Entitlement Length","Vintage Dependent Start Date","Eligible Days  in vintage","% of  potential ESCs (prorated) ","ED Check ","Vintage Check"]
[null,null,null,null,null,null,null,null,null,null,null,null,null,null,null,null,null,null,null,null,{"$f":"IF(AW7<>\"\",AW7, \"\")","v":""},{"$f":"IF(U7<>\"\", U7*$G$2*Tables!$B$1,\"\")","v":""},null,{"$f":"IF(E7<>\"\", CONCATENATE(E7,\"-\",G7),\"\")","v":""},{"$f":"IF($E7<>\"\",VLOOKUP(Input!$X7,Tables!$E$5:$G$200,2,FALSE), \"\")","v":""},{"$f":"IF($F7=\"\",\"\", VLOOKUP(Input!$X7,Tables!$E$5:$G$200,3,FALSE))","v":""},{"$f":"IF($E7<>\"\",C7*(Y7*F7), \"\")","v":""},{"$f":"IF(X7<>\"\",C7*Z7,\"\")","v":""},10,10,{"$f":"IF(W7=\"\",\"\",W7)","v":""},1,{"$f":"IF($E7<>\"\",VLOOKUP(Input!J7,Tables!$L$5:$M$9,2,FALSE), \"\")","v":""},null,{"$f":"IF($E7<>\"\",((AA7*AC7+AB7*AD7)*AE7*AF7*AG7)/10^6, \"\")","v":""},null,{"$f":"IF(N7<>\"\", CONCATENATE(N7,\"-\",P7),\"\")","v":""},{"$f":"IF($N7<>\"\",VLOOKUP(Input!$AK7,Tables!$E$5:$G$200,2,FALSE), \"\")","v":""},{"$f":"IF($O7=\"\",\"\",VLOOKUP(Input!$AK7,Tables!$E$5:$G$200,3,FALSE))","v":""},{"$f":"IF($E7<>\"\",L7*(AL7*O7), \"\")","v":""},{"$f":"IF(AK7<>\"\",AM7*L7,\"\")","v":""},{"$f":"IF(AC7<>\"\",AC7,\"\")","v":10},{"$f":"IF(AD7<>\"\",AD7,\"\")","v":10},{"$f":"IF(W7=\"\",\"\",W7)","v":""},1,{"$f":"IF($O7<>\"\",VLOOKUP(Input!S7,Tables!$L$5:$M$9,2,FALSE), \"\")","v":""},null,{"$f":"IF($E7<>\"\",(AN7*AP7+AO7*AQ7)*AR7*AS7*AT7/10^6, \"\")","v":""},{"$f":"IF($O7<>\"\",AI7-AV7,\"\")","v":""},{"$f":"IF($O7<>\"\",AW7*G$2,\"\")","v":""},"N","N","N","N/A","x","x",null,null,null,null,null,null,{"$f":"T7","v":"00:00:00"},{"$f":"MIN(AC7,AD7)/Tables!B$3","v":1},{"$f":"(((DATE(YEAR(BK7)+Tables!$B$3,MONTH(BK7),DAY(BK7))-BK7)*BL7))","v":3653},{"$f":"BK7+BM7","v":"1909-12-31"},{"$f":"BH7","v":"00:00:00"},{"$f":"IF(BK7>=BO7,BK7,BO7)","v":"00:00:00"},{"$f":"BN7-BP7","v":3653},{"$f":"IF(BP7>$BJ$5,BP7,$BJ$5)","v":"2012-01-01"},{"$f":"IF((BN7-BR7)<0,0,(BN7-BR7))","v":0},{"$f":"1","v":1},{"$f":"BK7-BO7","v":0},{"$f":"BK7-BR7","v":-40909},null,null,null,null,null,null,null,null,{"$f":"IF($O7=\"\",\"\",IF(AY7=\"N\",IF(AZ7=\"N\",IF(BA7=\"N\",\"NO\",\"YES\"),\"YES\"),\"YES\"))","v":""},{"$f":"IF($O7=\"\",\"\",IF(YEAR(BK7)>YEAR($BJ$5),YEAR(BK7),YEAR($BJ$5)))","v":""}]
[null,null,null,null,null,null,null,null,null,null,null,null,null,null,null,null,null,null,null,null,"",{"$f":"IF(U8<>\"\", U8*$G$2*Tables!$B$1,\"\")","v":""},null,"",{"$f":"IF($E8<>\"\",VLOOKUP(Input!$X8,Tables!$E$5:$G$200,2,FALSE), \"\")","v":""},{"$f":"IF($F8=\"\",\"\", VLOOKUP(Input!$X8,Tables!$E$5:$G$200,3,FALSE))","v":""},"","",10,10,"",1,{"$f":"IF($E8<>\"\",VLOOKUP(Input!J8,Tables!$L$5:$M$9,2,FALSE), \"\")","v":""},null,"",null,"",{"$f":"IF($N8<>\"\",VLOOKUP(Input!$AK8,Tables!$E$5:$G$200,2,FALSE), \"\")","v":""},{"$f":"IF($O8=\"\",\"\",VLOOKUP(Input!$AK8,Tables!$E$5:$G$200,3,FALSE))","v":""},"","",10,10,"",1,{"$f":"IF($O8<>\"\",VLOOKUP(Input!S8,Tables!$L$5:$M$9,2,FALSE), \"\")","v":""},null,"","","","N","N","N","N/A","u","u",null,null,null,null,null,null,{"$f":"T8","v":"00:00:00"},{"$f":"MIN(AC8,AD8)/Tables!B$3","v":1},{"$f":"(((DATE(YEAR(BK8)+Tables!$B$3,MONTH(BK8),DAY(BK8))-BK8)*BL8))","v":3653},"1909-12-31",{"$f":"BH8","v":"00:00:00"},{"$f":"IF(BK8>=BO8,BK8,BO8)","v":"00:00:00"},3653,{"$f":"IF(BP8>$BJ$5,BP8,$BJ$5)","v":"2012-01-01"},0,{"$f":"1","v":1},{"$f":"BK8-BO8","v":0},{"$f":"BK8-BR8","v":-40909},null,null,null,null,null,null,null,null,{"$f":"IF($O8=\"\",\"\",IF(AY8=\"N\",IF(AZ8=\"N\",IF(BA8=\"N\",\"NO\",\"YES\"),\"YES\"),\"YES\"))","v":""},{"$f":"IF($O8=\"\",\"\",IF(YEAR(BK8)>YEAR($BJ$5),YEAR(BK8),YEAR($BJ$5)))","v":""}]
[null,null,null,null,null,null,null,null,null,null,null,null,null,null,null,null,null,null,null,null,"",{"$f":"IF(U9<>\"\", U9*$G$2*Tables!$B$1,\"\")","v":""},null,"",{"$f":"IF($E9<>\"\",VLOOKUP(Input!$X9,Tables!$E$5:$G$200,2,FALSE), \"\")","v":""},{"$f":"IF($F9=\"\",\"\", VLOOKUP(Input!$X9,Tables!$E$5:$G$200,3,FALSE))","v":""},"","",null,null,"",null,{"$f":"IF($E9<>\"\",VLOOKUP(Input!J9,Tables!$L$5:$M$9,2,FALSE), \"\")","v":""},null,"",null,"",{"$f":"IF($N9<>\"\",VLOOKUP(Input!$AK9,Tables!$E$5:$G$200,2,FALSE), \"\")","v":""},{"$f":"IF($O9=\"\",\"\",VLOOKUP(Input!$AK9,Tables!$E$5:$G$200,3,FALSE))","v":""},"","","","","",null,{"$f":"IF($O9<>\"\",VLOOKUP(Input!S9,Tables!$L$5:$M$9,2,FALSE), \"\")","v":""},null,"","","",null,null,null,null,null,null,null,null,null,null,null,null,{"$f":"T9","v":"00:00:00"},{"$f":"MIN(AC9,AD9)/Tables!B$3","v":0},{"$f":"(((DATE(YEAR(BK9)+Tables!$B$3,MONTH(BK9),DAY(BK9))-BK9)*BL9))","v":0},"00:00:00",{"$f":"BH9","v":"00:00:00"},"00:00:00",0,{"$f":"IF(BP9>$BJ$5,BP9,$BJ$5)","v":"2012-01-01"},0,{"$f":"1","v":1},0,-40909,null,null,null,null,null,null,null,null,"",""]
[null,null,null,null,null,null,null,null,null,null,null,null,null,null,null,null,null,null,null,null,"",{"$f":"IF(U10<>\"\", U10*$G$2*Tables!$B$1,\"\")","v":""},null,"",{"$f":"IF($E10<>\"\",VLOOKUP(Input!$X10,Tables!$E$5:$G$200,2,FALSE), \"\")","v":""},{"$f":"IF($F10=\"\",\"\", VLOOKUP(Input!$X10,Tables!$E$5:$G$200,3,FALSE))","v":""},"","",null,null,"",null,{"$f":"IF($E10<>\"\",VLOOKUP(Input!J10,Tables!$L$5:$M$9,2,FALSE), \"\")","v":""},null,"",null,"",{"$f":"IF($N10<>\"\",VLOOKUP(Input!$AK10,Tables!$E$5:$G$200,2,FALSE), \"\")","v":""},{"$f":"IF($O10=\"\",\"\",VLOOKUP(Input!$AK10,Tables!$E$5:$G$200,3,FALSE))","v":""},"","","","","",null,{"$f":"IF($O10<>\"\",VLOOKUP(Input!S10,Tables!$L$5:$M$9,2,FALSE), \"\")","v":""},null,"","","",null,null,null,null,null,null,null,null,null,null,null,null,{"$f":"T10","v":"00:00:00"},{"$f":"MIN(AC10,AD10)/Tables!B$3","v":0},{"$f":"(((DATE(YEAR(BK10)+Tables!$B$3,MONTH(BK10),DAY(BK10))-BK10)*BL10))","v":0},"00:00:00",{"$f":"BH10","v":"00:00:00"},"00:00:00",0,{"$f":"IF(BP10>$BJ$5,BP10,$BJ$5)","v":"2012-01-01"},0,{"$f":"1","v":1},0,-40909,null,null,null,null,null,null,null,null,"",""]
[null,null,null,null,null,null,null,null,null,null,null,null,null,null,null,null,null,null,null,null,"",{"$f":"IF(U11<>\"\", U11*$G$2*Tables!$B$1,\"\")","v":""},null,"",{"$f":"IF($E11<>\"\",VLOOKUP(Input!$X11,Tables!$E$5:$G$200,2,FALSE), \"\")","v":""},{"$f":"IF($F11=\"\",\"\", VLOOKUP(Input!$X11,Tables!$E$5:$G$200,3,FALSE))","v":""},"","",null,null,"",null,{"$f":"IF($E11<>\"\",VLOOKUP(Input!J11,Tables!$L$5:$M$9,2,FALSE), \"\")","v":""},null,"",null,"",{"$f":"IF($N11<>\"\",VLOOKUP(Input!$AK11,Tables!$E$5:$G$200,2,FALSE), \"\")","v":""},{"$f":"IF($O11=\"\",\"\",VLOOKUP(Input!$AK11,Tables!$E$5:$G$200,3,FALSE))","v":""},"","","","","",null,{"$f":"IF($O11<>\"\",VLOOKUP(Input!S11,Tables!$L$5:$M$9,2,FALSE), \"\")","v":""},null,"","","",null,null,null,null,null,null,null,null,null,null,null,null,{"$f":"T11","v":"00:00:00"},{"$f":"MIN(AC11,AD11)/Tables!B$3","v":0},{"$f":"(((DATE(YEAR(BK11)+Tables!$B$3,MONTH(BK11),DAY(BK11))-BK11)*BL11))","v":0},"00:00:00",{"$f":"BH11","v":"00:00:00"},"00:00:00",0,{"$f":"IF(BP11>$BJ$5,BP11,$BJ$5)","v":"2012-01-01"},0,{"$f":"1","v":1},0,-40909,null,null,null,null,null,null,null,null,"",""]
[null,null,null,null,null,null,null,null,null,null,null,null,null,null,null,null,null,null,null,null,"",{"$f":"IF(U12<>\"\", U12*$G$2*Tables!$B$1,\"\")","v":""},null,"",{"$f":"IF($E12<>\"\",VLOOKUP(Input!$X12,Tables!$E$5:$G$200,2,FALSE), \"\")","v":""},{"$f":"IF($F12=\"\",\"\", VLOOKUP(Input!$X12,Tables!$E$5:$G$200,3,FALSE))","v":""},"","",null,null,"",null,{"$f":"IF($E12<>\"\",VLOOKUP(Input!J12,Tables!$L$5:$M$9,2,FALSE), \"\")","v":""},null,"",null,"",{"$f":"IF($N12<>\"\",VLOOKUP(Input!$AK12,Tables!$E$5:$G$200,2,FALSE), \"\")","v":""},{"$f":"IF($O12=\"\",\"\",VLOOKUP(Input!$AK12,Tables!$E$5:$G$200,3,FALSE))","v":""},"","","","","",null,{"$f":"IF($O12<>\"\",VLOOKUP(Input!S12,Tables!$L$5:$M$9,2,FALSE), \"\")","v":""},null,"","","",null,null,null,null,null,null,null,null,null,null,null,null,{"$f":"T12","v":"00:00:00"},{"$f":"MIN(AC12,AD12)/Tables!B$3","v":0},{"$f":"(((DATE(YEAR(BK12)+Tables!$B$3,MONTH(BK12),DAY(BK12))-BK12)*BL12))","v":0},"00:00:00",{"$f":"BH12","v":"00:00:00"},"00:00:00",0,{"$f":"IF(BP12>$BJ$5,BP12,$BJ$5)","v":"2012-01-01"},0,{"$f":"1","v":1},0,-40909,null,null,null,null,null,null,null,null,"",""]
[null,null,null,null,null,null,null,null,null,null,null,null,null,null,null,null,null,null,null,null,"",{"$f":"IF(U13<>\"\", U13*$G$2*Tables!$B$1,\"\")","v":""},null,"",{"$f":"IF($E13<>\"\",VLOOKUP(Input!$X13,Tables!$E$5:$G$200,2,FALSE), \"\")","v":""},{"$f":"IF($F13=\"\",\"\", VLOOKUP(Input!$X13,Tables!$E$5:$G$200,3,FALSE))","v":""},"","",null,null,"",null,{"$f":"IF($E13<>\"\",VLOOKUP(Input!J13,Tables!$L$5:$M$9,2,FALSE), \"\")","v":""},null,"",null,"",{"$f":"IF($N13<>\"\",VLOOKUP(Input!$AK13,Tables!$E$5:$G$200,2,FALSE), \"\")","v":""},{"$f":"IF($O13=\"\",\"\",VLOOKUP(Input!$AK13,Tables!$E$5:$G$200,3,FALSE))","v":""},"","","","","",null,{"$f":"IF($O13<>\"\",VLOOKUP(Input!S13,Tables!$L$5:$M$9,2,FALSE), \"\")","v":""},null,"","","",null,null,null,null,null,null,null,null,null,null,null,null,"00:00:00",{"$f":"MIN(AC13,AD13)/Tables!B$3","v":0},{"$f":"(((DATE(YEAR(BK13)+Tables!$B$3,MONTH(BK13),DAY(BK13))-BK13)*BL13))","v":0},"00:00:00","00:00:00","00:00:00",0,"2012-01-01",0,{"$f":"1","v":1},0,-40909,null,null,null,null,null,null,null,null,"",""]
[null,null,null,null,null,null,null,null,null,null,null,null,null,null,null,null,null,null,null,null,"",{"$f":"IF(U14<>\"\", U14*$G$2*Tables!$B$1,\"\")","v":""},null,"",{"$f":"IF($E14<>\"\",VLOOKUP(Input!$X14,Tables!$E$5:$G$200,2,FALSE), \"\")","v":""},{"$f":"IF($F14=\"\",\"\", VLOOKUP(Input!$X14,Tables!$E$5:$G$200,3,FALSE))","v":""},"","",null,null,"",null,{"$f":"IF($E14<>\"\",VLOOKUP(Input!J14,Tables!$L$5:$M$9,2,FALSE), \"\")","v":""},null,"",null,"",{"$f":"IF($N14<>\"\",VLOOKUP(Input!$AK14,Tables!$E$5:$G$200,2,FALSE), \"\")","v":""},{"$f":"IF($O14=\"\",\"\",VLOOKUP(Input!$AK14,Tables!$E$5:$G$200,3,FALSE))","v":""},"","","","","",null,{"$f":"IF($O14<>\"\",VLOOKUP(Input!S14,Tables!$L$5:$M$9,2,FALSE), \"\")","v":""},null,"","","",null,null,null,null,null,null,null,null,null,null,null,null,"00:00:00",{"$f":"MIN(AC14,AD14)/Tables!B$3","v":0},{"$f":"(((DATE(YEAR(BK14)+Tables!$B$3,MONTH(BK14),DAY(BK14))-BK14)*BL14))","v":0},"00:00:00","00:00:00","00:00:00",0,"2012-01-01",0,{"$f":"1","v":1},0,-40909,null,null,null,null,null,null,null,null,"",""]
[null,null,null,null,null,null,null,null,null,null,null,null,null,null,null,null,null,null,null,null,"",{"$f":"IF(U15<>\"\", U15*$G$2*Tables!$B$1,\"\")","v":""},null,"",{"$f":"IF($E15<>\"\",VLOOKUP(Input!$X15,Tables!$E$5:$G$200,2,FALSE), \"\")","v":""},{"$f":"IF($F15=\"\",\"\", VLOOKUP(Input!$X15,Tables!$E$5:$G$200,3,FALSE))","v":""},"","",null,null,"",null,{"$f":"IF($E15<>\"\",VLOOKUP(Input!J15,Tables!$L$5:$M$9,2,FALSE), \"\")","v":""},null,"",null,"",{"$f":"IF($N15<>\"\",VLOOKUP(Input!$AK15,Tables!$E$5:$G$200,2,FALSE), \"\")","v":""},{"$f":"IF($O15=\"\",\"\",VLOOKUP(Input!$AK15,Tables!$E$5:$G$200,3,FALSE))","v":""},"","","","","",null,{"$f":"IF($O15<>\"\",VLOOKUP(Input!S15,Tables!$L$5:$M$9,2,FALSE), \"\")","v":""},null,"","","",null,null,null,null,null,null,null,null,null,null,null,null,"00:00:00",{"$f":"MIN(AC15,AD15)/Tables!B$3","v":0},{"$f":"(((DATE(YEAR(BK15)+Tables!$B$3,MONTH(BK15),DAY(BK15))-BK15)*BL15))","v":0},"00:00:00","00:00:00","00:00:00",0,"2012-01-01",0,{"$f":"1","v":1},0,-40909,null,null,null,null,null,null,null,null,"",""]
{"$rows_left_out":94}
{"sheet":"Tables (3)","index":2,"n_rows":98,"n_cols":21,"rows_kept":98,"cut":false,"hidden":true,"merged":[]}
["Certificate conversion factor",1.06,"t CO2-e / MWh",null,0,"SelectedArea",null,"Lifetimeform open?"]
["Site Annual Operating Hours",4500,"hours per annum",null,10,"NextAvailRow"]
["Asset Lifetime",12,"years",null,"Lamp circuit power equation","y=mX+C"]
["Lamp type",null,null,null,"Lamp+ballast/transformer type","M value","C value",null,"Control System","Factor",null,"Airconditioned space","Factor",null,"T8 - T12 ballasts","Approved lamp type 1",null,null,null,"BCA Classification","AOH"]
["T8 or T12",null,null,null,"T8 or T12-D",1,12,null,"none",1,null,"Yes",1.3,null,"D",null,null,null,null,"Class 2 (Common Area)",7000]
["T5",null,null,null,"T8 or T12-C",1,10,null,"Occupancy sensor",0.7,null,"No",1,null,"C",null,null,null,null,"Class 3 (Common Area)",7000]
["CFLn",null,null,null,"T8 or T12-B2",1,8,null,"Daylight linked control",0.7,null,null,null,null,"B2",null,null,null,null,"Class 3 (Other than Common Areas)",3000]
["Circular fluorescent",null,null,null,"T8 or T12-B1",1,6,null,"Programmable dimming",0.85,null,null,null,null,"B1",null,null,null,null,"Class 4",3000]
["Metal halide",null,null,null,"T8 or T12-A3",1,2,null,"Manual dimming",0.9,null,null,null,null,"A3",null,null,null,null,"Class 5",3000]
["Mercury Vapour",null,null,null,"T8 or T12-A2",1,0,null,null,null,null,null,null,null,"A2",null,null,null,null,"Class 6",5000]
["High pressure sodium",null,null,null,"T8 or T12-A1",1,2,null,null,null,null,null,null,null,"A1",null,null,null,null,"Class 7",5000]
["Tungsten halogen-240V",null,null,null,"T5-A3",1.1299999999999999,2.5,null,null,null,null,null,null,null,null,null,null,null,null,"Class 7(a) (Carparks)",7000]
["CFLi",null,null,null,"T5-A2",1.08,1.5,null,null,null,null,null,null,null,"T5",null,null,null,null,"Class 8 (Other than ANZIC Code C, Manufacturing)",3000]
["Tungsten halogen-ELV",null,null,null,"T5-A1",1.1299999999999999,2.5,null,null,null,null,null,null,null,"A3",null,null,null,null,"Class 8 (ANZIC Code C, Manufacturing)",5000]
["LED lamp only",null,null,null,"CFLn-D",1,11,null,null,null,null,null,null,null,"A2",null,null,null,null,"Class 9a or Class 9c",6000]
{"$rows_left_out":84}
{"sheet":"Tables","index":3,"n_rows":113,"n_cols":31,"rows_kept":113,"cut":false,"hidden":false,"merged":[]}
["Certificate conversion factor",1.06,"t CO2-e / MWh",null,7,"SelectedArea",null,"Lifetimeform open?",null,null,null,null,null,null,null,null,null,null,null,null,null,null,null,null,null,null,null,null,"Control System only - Max lifetime",5,"years"]
["Site Annual Operating Hours",3000,"hours per annum",null,7,"NextAvailRow",false,"Open UPGRADEForm in EditMode"]
["Asset Lifetime",10,"years",null,"Lamp circuit power equation","y=mX+C"]
["Lamp type",null,null,null,"Lamp+ballast/transformer type","M value","C value",null,"Control System","Factor",null,"Airconditioned space","Factor",null,"T8 - T12 ballasts","Approved lamp type 1",null,null,null,"BCA Space Type (A10.2)","AOH","Building/Space Group",null,"Starting Postcode ","Ending Postcode","Regional Network Factor",null,null,"Group","Max Asset Lifetime\n(Regional Site)","Max Asset Lifetime\n(Other Site)"]
["T8 or T12 Linear",null,null,null,"T8 or T12 Linear-EEI D",1,12,null,"none",1,null,"Air conditioned (refrigerant based AC)",1.07,null,"EEI D",null,null,null,null,"Auditorium, church and public hall",2000,"A (Others)",null,2311,2312,1.03,null,null,"A (Others)",10,7.3]
["T5 Linear or T5 Circular",null,null,null,"T8 or T12 Linear-EEI C",1,10,null,"Occupancy sensor",0.7,null,"Data Centre (refrigerant based AC)",1.3,null,"EEI C",null,null,null,null,"Board room and conference room",3000,"B (Office)",null,2321,2321,1.03,null,null,"B (Office)",10,7.4]
["CFLn",null,null,null,"T8 or T12 Linear-EEI B2",1,8,null,"Daylight linked control",0.7,null,"Refrigerated room",1.3,null,"EEI B2",null,null,null,null,"Carpark - general (undercover)",7000,"C (Industrial)",null,2324,2324,1.03,null,null,"C (Industrial)",11.7,11.7]
["T9 or T12 Circular fluorescent",null,null,null,"T8 or T12 Linear-EEI B1",1,6,null,"Programmable dimming",0.85,null,"Other airconditioning (non-refrigerant based)",1,null,"EEI B1",null,null,null,null,"Carpark - entry zone",7000,"C (Industrial)",null,2329,2329,1.03,null,null,"D (Retail)",10,7.4]
["Metal halide",null,null,null,"T8 or T12 Linear-EEI A3",1,2,null,"Manual dimming",0.9,null,"No Air conditioning",1,null,"EEI A3",null,null,null,null,"Carpark - general (open air)",4500,"C (Industrial)",null,2338,2490,1.03,null,null,"E (Public)",12,12]
["Mercury Vapour",null,null,null,"T8 or T12 Linear-EEI A2",1,0,null,"Specialised - Occupancy Sensor 1",0.55000000000000004,null,null,null,null,"EEI A2",null,null,null,null,"Common rooms, spaces, corridors in a Class 2 building (including stairways and lift cars)",7000,"A (Others)",null,2536,2537,1.03]
["High pressure sodium",null,null,null,"T8 or T12 Linear-EEI A1",1,2,null,"Specialised - Occupancy Sensor 2",0.3,null,null,null,null,"EEI A1",null,null,null,null,"Control room, switch room, and the like – intermittent monitoring and constant monitoring",null,null,null,2545,2551,1.03]
["Tungsten halogen (240V)",null,null,null,"T5 Linear or T5 Circular-EEI A3",1.1299999999999999,2.5,null,"Specialised - Occupancy Sensor 3",0.15,null,null,null,null,null,null,null,null,null,"Corridors",null,null,null,2579,2594,1.03]
["CFLi",null,null,null,"T5 Linear or T5 Circular-EEI A2",1.08,1.5,null,"Specialised - Occupancy Sensor 4",0.25,null,null,null,null,"T5",null,null,null,null,"Courtroom",2000,"A (Others)",null,2611,2611,1.03]
["Tungsten halogen (ELV)",null,null,null,"T5 Linear or T5 Circular-EEI A1",1.1299999999999999,2.5,null,null,null,null,null,null,null,"EEI A3",null,null,null,null,"Dormitory of a Class 3 building used for sleeping or sleeping and study",3000,"A (Others)",null,2618,2739,1.03]
["LED Lamp only - ELV",null,null,null,"CFLn-EEI D",1,11,null,null,null,null,null,null,null,"EEI A2",null,null,null,null,"Entry lobby from outside the building",null,null,null,2787,2787,1.03]
{"$rows_left_out":99}
{"sheet":"Summary","index":4,"n_rows":106,"n_cols":7,"rows_kept":106,"cut":false,"hidden":false,"merged":[]}
[]
[]
[]
[]
[1,2,9,11,12,13,17]
["Number","Space","Implementation Date","Baseline Consumption (MWh)","Upgrade Consumption (MWh)","Savings (MWh)","ESCs Generated"]
[1,{"$f":"IF( Input!B7=\"\",\"\",Input!B7)","v":""},{"$f":"IF(Input!T7=\"\",\"\",Input!T7)","v":""},{"$f":"IF(Input!AI7=\"\",\"\",Input!AI7)","v":""},{"$f":"IF(Input!AV7=\"\",\"\",Input!AV7)","v":""},{"$f":"IF(Input!U7=\"\",\"\",Input!U7)","v":""},{"$f":"IF(Input!V7=\"\",\"\",Input!V7)","v":""}]
[2,{"$f":"IF( Input!B8=\"\",\"\",Input!B8)","v":""},{"$f":"IF(Input!T8=\"\",\"\",Input!T8)","v":""},{"$f":"IF(Input!AI8=\"\",\"\",Input!AI8)","v":""},{"$f":"IF(Input!AV8=\"\",\"\",Input!AV8)","v":""},{"$f":"IF(Input!U8=\"\",\"\",Input!U8)","v":""},{"$f":"IF(Input!V8=\"\",\"\",Input!V8)","v":""}]
[3,{"$f":"IF( Input!B9=\"\",\"\",Input!B9)","v":""},{"$f":"IF(Input!T9=\"\",\"\",Input!T9)","v":""},{"$f":"IF(Input!AI9=\"\",\"\",Input!AI9)","v":""},{"$f":"IF(Input!AV9=\"\",\"\",Input!AV9)","v":""},{"$f":"IF(Input!U9=\"\",\"\",Input!U9)","v":""},{"$f":"IF(Input!V9=\"\",\"\",Input!V9)","v":""}]
[4,{"$f":"IF( Input!B10=\"\",\"\",Input!B10)","v":""},{"$f":"IF(Input!T10=\"\",\"\",Input!T10)","v":""},{"$f":"IF(Input!AI10=\"\",\"\",Input!AI10)","v":""},{"$f":"IF(Input!AV10=\"\",\"\",Input!AV10)","v":""},{"$f":"IF(Input!U10=\"\",\"\",Input!U10)","v":""},{"$f":"IF(Input!V10=\"\",\"\",Input!V10)","v":""}]
[5,{"$f":"IF( Input!B11=\"\",\"\",Input!B11)","v":""},{"$f":"IF(Input!T11=\"\",\"\",Input!T11)","v":""},{"$f":"IF(Input!AI11=\"\",\"\",Input!AI11)","v":""},{"$f":"IF(Input!AV11=\"\",\"\",Input!AV11)","v":""},{"$f":"IF(Input!U11=\"\",\"\",Input!U11)","v":""},{"$f":"IF(Input!V11=\"\",\"\",Input!V11)","v":""}]
[6,{"$f":"IF( Input!B12=\"\",\"\",Input!B12)","v":""},{"$f":"IF(Input!T12=\"\",\"\",Input!T12)","v":""},{"$f":"IF(Input!AI12=\"\",\"\",Input!AI12)","v":""},{"$f":"IF(Input!AV12=\"\",\"\",Input!AV12)","v":""},{"$f":"IF(Input!U12=\"\",\"\",Input!U12)","v":""},{"$f":"IF(Input!V12=\"\",\"\",Input!V12)","v":""}]
[7,{"$f":"IF( Input!B13=\"\",\"\",Input!B13)","v":""},{"$f":"IF(Input!T13=\"\",\"\",Input!T13)","v":""},{"$f":"IF(Input!AI13=\"\",\"\",Input!AI13)","v":""},{"$f":"IF(Input!AV13=\"\",\"\",Input!AV13)","v":""},{"$f":"IF(Input!U13=\"\",\"\",Input!U13)","v":""},{"$f":"IF(Input!V13=\"\",\"\",Input!V13)","v":""}]
[8,{"$f":"IF( Input!B14=\"\",\"\",Input!B14)","v":""},{"$f":"IF(Input!T14=\"\",\"\",Input!T14)","v":""},{"$f":"IF(Input!AI14=\"\",\"\",Input!AI14)","v":""},{"$f":"IF(Input!AV14=\"\",\"\",Input!AV14)","v":""},{"$f":"IF(Input!U14=\"\",\"\",Input!U14)","v":""},{"$f":"IF(Input!V14=\"\",\"\",Input!V14)","v":""}]
[9,{"$f":"IF( Input!B15=\"\",\"\",Input!B15)","v":""},{"$f":"IF(Input!T15=\"\",\"\",Input!T15)","v":""},{"$f":"IF(Input!AI15=\"\",\"\",Input!AI15)","v":""},{"$f":"IF(Input!AV15=\"\",\"\",Input!AV15)","v":""},{"$f":"IF(Input!U15=\"\",\"\",Input!U15)","v":""},{"$f":"IF(Input!V15=\"\",\"\",Input!V15)","v":""}]
{"$rows_left_out":92}
{"sheet":"Report","index":5,"n_rows":120,"n_cols":34,"rows_kept":120,"cut":false,"hidden":true,"merged":[[0,1,0,25],[19,1,19,2],[20,1,20,2],[13,1,13,8],[6,2,6,8],[12,2,12,8],[5,2,5,8],[24,29,24,31],[24,21,24,28],[21,1,21,2],[24,32,24,33],[11,2,11,8],[24,2,24,10],[24,11,24,20],[24,0,24,1]]}
[null,"I declare that:\n1.  I have collected and retained all documentation required to support this ESC calculation\n2.  I have acceptance from the Scheme Administrator for the emerging lighting technology entered into this calculator (If appropriate)\n3.  the RESA has been implemented in accordance with legislative requirements, including safety legislation.\n"]
[null,"Accredited Certificate Provider:","QEWR"]
[null,"Name","QEW"]
[null,"Position","EWQR"]
[null,"Resa ID ","QER"]
[null,"Date ","QEWR"]
[null,"Date of Report Generation:",{"$f":"TODAY()","v":"2023-05-05"}]
[]
[null,"End Use Application:",{"$f":"IF(Input!A1=\"\",\"\",Input!A1)","v":""}]
[null,"Site Name:",{"$f":"IF(Input!A2=\"\",\"\",Input!A2)","v":""}]
[null,"Site Address:",{"$f":"IF(Input!A3=\"\",\"\",Input!A3)","v":""}]
[null,"Implementation ID:",{"$f":"Input!H2","v":0}]
[null,"Implementation Date:",{"$f":"Input!E2","v":"00:00:00"}]
[null,"Original Energy Saver (Purchaser):"]
[null,"Site Contact","TP"]
{"$rows_left_out":105}