{"text_format":"1","workbook":"xlsx","n_sheets":18,"sheets":["A. Input_by Equipment Class","B. Input_by Activity Definition","C. Evidence Checklist","Drop down lists","HEER vs CL & VEU requirements","Products by Activity Definition","LED Lamp Only 240V requirements","E.11_Minimum light output","LED_240V_E.1","LED_ELV_E.1","LED_recessed_E.1","LED_lamp.driver_E.1","LED_floodlight_E.2","LED_240V_E.3","LED_floodlight_E.3","LED_linear_E.5","LED_240V_E.11","LED_linear_E.13"],"not_rendered":{"charts":0,"images":2,"macros":1,"external_links":0,"defined_names":25,"comments":0,"pivot_tables":0},"unopened":[],"bounds":{"document_bytes":16777216,"sheet_cells":100000,"rows_first":2000,"rows_last":500,"rows_between":2000,"halvings":0,"cell_chars":16384,"cell_head_chars":4096},"cells_cut":0,"cells_raw":0,"read":"whole","date_system":"1900"}

{"sheet":"A. Input_by Equipment Class","index":0,"n_rows":32,"n_cols":15,"rows_kept":32,"cut":false,"hidden":false,"merged":[[9,3,9,8],[10,3,10,8],[11,3,11,8],[3,6,3,8]]}
[]
[null,null,{"$f":"IF(OR(C4=\"Please select …\",C4=\"\"),\"1. Select lighting category\",\"\")","v":"1. Select lighting category"},{"$f":"IF(OR(C4=\"Please select …\",D4=\"\"),\"2. Select Activity Definition\",\"\")","v":"2. Select Activity Definition"}]
[null,{"$f":"HLOOKUP($C4,'Drop down lists'!$A$19:$G$20,2,0)","v":{"$error":"#N/A"}},"Select Equipment Class","Select Eligible Activity Definitions"]
[null,{"$f":"IF(D4=\"\",\"\",D4)","v":""},null,null,null,null,"Rated Lumen Output ≥ average lumen output of the existing equipment, as defined in Activity E11: Minimum lumen output (click to view)"]
[]
[null,null,"Is product accepted for use by ESS?\n(Commercial Lighting Method)",null,{"$f":"IF(OR(D6=\"Please select …\",D6=\"\"),\"3. Select whether the product is already accepted for use under the Commercial Lighting method in the ESS\",\"\")","v":"3. Select whether the product is already accepted for use under the Commercial Lighting method in the ESS"}]
{"$rows_left_out":27}
{"sheet":"B. Input_by Activity Definition","index":1,"n_rows":32,"n_cols":15,"rows_kept":32,"cut":false,"hidden":false,"merged":[[9,3,9,8],[10,3,10,8],[11,3,11,8],[3,6,3,8]]}
[]
[null,null,{"$f":"IF(OR(C4=\"Please select proposed lighting activities …\",C4=\"\"),\"1. Select Activity Definition\",\"\")","v":"1. Select Activity Definition"},{"$f":"IF(OR(C4=\"Please select proposed lighting activities …\",D4=\"Please select …\",D4=\"\"),\"2. Select lighting category\",\"\")","v":"2. Select lighting category"}]
[null,{"$f":"HLOOKUP($D4,'Drop down lists'!$A$19:$G$20,2,0)","v":{"$error":"#N/A"}},"Select Activity Defintion","Select Eligible Equipment Classes"]
[null,{"$f":"IF(C4=\"\",\"\",C4)","v":"Please select proposed lighting activities …"},"Please select proposed lighting activities …",null,null,null,"Rated Lumen Output ≥ average lumen output of the existing equipment, as defined in Activity E11: Minimum lumen output (click to view)"]
[]
[null,null,"Is product accepted for use by ESS?\n(Commercial Lighting Method)","Please select …",{"$f":"IF(OR(D6=\"Please select …\",D6=\"\"),\"3. Select whether the product is already accepted for use under the Commercial Lighting method in the ESS\",\"\")","v":"3. Select whether the product is already accepted for use under the Commercial Lighting method in the ESS"}]
{"$rows_left_out":27}
{"sheet":"C. Evidence Checklist","index":2,"n_rows":110,"n_cols":20,"rows_kept":110,"cut":false,"hidden":false,"merged":[[0,11,0,19]]}
[null,null,null,null,null,null,null,null,null,null,"Version 2.3  September 2022","You must submit a copy of this checklist with your application. The product information you enter must be consistent with all documentation you submit. If you supply inconsistent or incomplete information it may delay your application. "]
[null,null,"Product Details",null,null,null,null,null,null,null,null,"Do you have the required evidence to demonstrate compliance with the following requirements? \nSelect Yes or No from the drop-down list as appropriate."]
[null,null,"Lamp Brand","Lamp Model","Driver Brand (if declared article)","Driver Model (if declared article)","LCP / NLP requested","Select Equipment Class","Select Eligible Activity Definitions","Is product accepted for use by ESS (Commercial Lighting Method)","Is product accepted for use by VEU program","Product Specification Sheet","Safety","EMC","Power Factor","LCP","CRI","Luminous efficacy","Light Output","Lifetime"]
[null,{"$f":"HLOOKUP($H4,'Drop down lists'!$A$19:$F$20,2,0)","v":{"$error":"#N/A"}},null,null,null,null,null,"Please select …","Please select …","Please select …","Please select …"]
[null,{"$f":"HLOOKUP($H5,'Drop down lists'!$A$19:$F$20,2,0)","v":{"$error":"#N/A"}}]
[null,{"$f":"HLOOKUP($H6,'Drop down lists'!$A$19:$F$20,2,0)","v":{"$error":"#N/A"}}]
{"$rows_left_out":105}
{"sheet":"Drop down lists","index":3,"n_rows":30,"n_cols":8,"rows_kept":30,"cut":false,"hidden":true,"merged":[]}
["Activity Definition: Lighting","Name of activity"]
["E.1","Replace halogen downlight with an LED luminaire and/or lamp"]
["E.2","Replace a linear halogen floodlight with a high efficiency lamp"]
["E.3","Replace parabolic aluminised reflector (PAR) lamp with efficient luminaire and/or lamp"]
["E.4","Replace a T8 or T12 luminaire with a T5 luminaire"]
["E.5","Replace a T8 or T12 luminaire with an LED luminaire"]
{"$rows_left_out":25}
{"sheet":"HEER vs CL & VEU requirements","index":4,"n_rows":26,"n_cols":8,"rows_kept":26,"cut":false,"hidden":false,"merged":[[1,1,1,5],[2,1,2,5],[17,1,17,5],[19,1,19,5]]}
[]
[null,"Some requirements of the Commercial Lighting method and the VEU scheme are the same as the HEER lighting requirements."]
[null,"The table below shows the requirements that we consider have already been addressed if the product is accepted under the Commercial Lighting method or the VEU scheme. "]
[]
[null,"Requirements that are the same between HEER, VEU and Commercial Lighting"]
[]
{"$rows_left_out":21}
{"sheet":"Products by Activity Definition","index":5,"n_rows":17,"n_cols":8,"rows_kept":17,"cut":false,"hidden":false,"merged":[[1,1,1,10],[15,1,15,10],[16,1,16,10],[2,1,2,10]]}
[]
[null,"Some product categories can be used for multiple activities under the HEER method, and have different requirements depending on the activity for which they will be used. "]
[null,"The table below shows the product categories and the activities for which they can be used. "]
[]
[null,"Products for each activity"]
[]
{"$rows_left_out":12}
{"sheet":"LED Lamp Only 240V requirements","index":6,"n_rows":15,"n_cols":5,"rows_kept":15,"cut":false,"hidden":false,"merged":[[1,1,1,6],[2,1,2,6],[14,1,14,6],[15,1,15,6],[16,1,16,6]]}
[]
[null,"Please identify each activity that you intend to install each product categorised as LED Lamp Only – 240V Self Ballasted."]
[null,"If you intend to install a product in implementations of both E1 and E3, please ensure that it meets the minimum requirements of both activities prior to submitting the required documentation."]
[]
[null,"Differences in LED Lamp Only 240V Self Ballasted requirements"]
[]
{"$rows_left_out":10}
{"sheet":"E.11_Minimum light output","index":7,"n_rows":16,"n_cols":5,"rows_kept":16,"cut":false,"hidden":false,"merged":[[6,1,6,3],[3,1,3,10],[4,1,4,10]]}
[]
[null,"Activity E11: Minimum Light Output (lumens)"]
[]
[null,"For Activity E11, ACPs must ensure that the Light Output (measured in lumens) of the new lighting equipment is the same, or higher than the existing lighting equipment it is replacing.  "]
[null,"To ensure that ACPs meet this requirement, they must:\n- check the type of the existing lighting equipment and its Lamp Circuit Power (LCP)\n- refer to Table B.11 and note the minimum Light Output required for the new lighting equipment, and\n- ensure that the new lighting equipment they install has a Light Output that is the same, or higher than this."]
[]
{"$rows_left_out":11}
{"sheet":"LED_240V_E.1","index":8,"n_rows":15,"n_cols":9,"rows_kept":15,"cut":false,"hidden":false,"merged":[[3,0,3,6]]}
["Description:","A self-ballasted LED Lamp as defined by AS/NZS 62560 Self-ballasted LED lamps for general lighting services by voltage > 50 V.  These Lamps are connected directly to a 240V supply."]
["Relevant Australian safety standard:","AS/NZS 62560: Self-ballasted LED-lamps for general lighting services by voltage > 50 V – Safety specifications"]
[null,""]
["Equipment Class: LED Lamp Only – 240V Self Ballasted"]
["Parameter","Requirement","Documentation Requirement 1","And/Or?","Documentation Requirement 2","Documentation Required","Minimum test sample size","Commercial Lighting Acceptance OK?","VEU Acceptance OK?"]
["Lamp Circuit Power (LCP)","LCP (as Published by the Scheme Administrator) ","Test report using IES LM-79-08 or other methodology from a laboratory accredited by National Association of Testing Authorities (NATA) or equivalent body","AND","Documentation showing the laboratory is accredited to perform IES LM-79-08 (if required)","At time of product acceptance",10,"Yes","Yes"]
{"$rows_left_out":10}
{"sheet":"LED_ELV_E.1","index":9,"n_rows":17,"n_cols":9,"rows_kept":17,"cut":false,"hidden":false,"merged":[[3,0,3,6]]}
["Description:","An LED Lamp that runs off an existing Extra-low voltage lighting converter (ELC) designed for retrofitting into an existing Luminaire or Lamp holder.  These are typically used as a replacement for ELV Tungsten halogen Lamps"]
["Relevant Australian safety standard:","N/A"]
[null,""]
["Equipment Class: LED Lamp Only – ELV  "]
["Parameter","Requirement","Documentation Requirement 1","And/Or?","Documentation Requirement 2","Documentation Required","Minimum test sample size","Commercial Lighting Acceptance OK?","VEU Acceptance OK?"]
["Nominal Lamp Power (NLP)","NLP (as Published by the Scheme Administrator)","Test report using IES LM-79-08 or other methodology from a laboratory accredited by National Association of Testing Authorities (NATA) or equivalent body.\nPlease note: NLP does not include power consumption of control gear. Test reports should ensure that control gear power consumption is not included.","AND","Documentation showing the laboratory is accredited to perform IES LM-79-08 (if required)","At time of product acceptance",10,"Yes","Yes"]
{"$rows_left_out":12}
{"sheet":"LED_recessed_E.1","index":10,"n_rows":33,"n_cols":9,"rows_kept":33,"cut":false,"hidden":false,"merged":[[3,0,3,6]]}
["Description:","An LED Luminaire intended for use as a recessed luminaire as defined in AS/NZS 60598.2.2 Luminaires – Particular requirements – Recessed luminaires "]
["Relevant Australian safety standard:","Luminaire: AS/NZS 60598.2.2 Luminaires - Particular requirements - Recessed luminaires"]
[null,"Control Gear: AS/NZS IEC 61347.1 Lamp control gear – General and safety requirements, and \nAS/NZS IEC 61347.2.13 Lamp control gear – Particular requirements for DC or AC supplied electronic control gear for LED modules"]
["Equipment Class: LED Luminaire - recessed"]
["Parameter","Requirement","Documentation Requirement 1","And/Or?","Documentation Requirement 2","Documentation Required","Minimum test sample size","Commercial Lighting Acceptance OK?","VEU Acceptance OK?"]
["Lamp Circuit Power (LCP)","LCP (as Published by the Scheme Administrator) ","Test report using IES LM-79-08 or other methodology from a laboratory accredited by National Association of Testing Authorities (NATA) or equivalent body","AND","Documentation showing the laboratory is accredited to perform IES LM-79-08 (if required)","At time of product acceptance",10,"Yes","Yes"]
{"$rows_left_out":28}
{"sheet":"LED_lamp.driver_E.1","index":11,"n_rows":34,"n_cols":9,"rows_kept":34,"cut":false,"hidden":false,"merged":[[3,0,3,6]]}
["Description:","An LED-reflector Lamp and matching LED Driver intended as an alternative to a Mirrored Reflector Halogen Lamp"]
["Relevant Australian safety standard:","Control Gear: AS/NZS IEC 61347.1 Lamp control gear – General and safety requirements, and \nAS/NZS IEC 61347.2.13 Lamp control gear – Particular requirements for DC or AC supplied electronic control gear for LED modules"]
[null,""]
["Equipment Class: LED Lamp and Driver"]
["Parameter","Requirement","Documentation Requirement 1","And/Or?","Documentation Requirement 2","Documentation Required","Minimum test sample size","Commercial Lighting Acceptance OK?","VEU Acceptance OK?"]
["Lamp Circuit Power (LCP)","LCP (as Published by the Scheme Administrator) ","Test report using IES LM-79-08 or other methodology from a laboratory accredited by National Association of Testing Authorities (NATA) or equivalent body","AND","Documentation showing the laboratory is accredited to perform IES LM-79-08 (if required)","At time of product acceptance",10,"Yes","Yes"]
{"$rows_left_out":29}
{"sheet":"LED_floodlight_E.2","index":12,"n_rows":33,"n_cols":9,"rows_kept":33,"cut":false,"hidden":false,"merged":[[3,0,3,6]]}
["Description:","An LED Luminaire intended for use as a floodlight as defined in AS/NZS 60598.2.5 Luminaires – Particular requirements - Floodlights"]
["Relevant Australian safety standard:","Luminaire: AS/NZS 60598.2.5 Luminaires - Particular requirements – Floodlights"]
[null,"Control Gear: AS/NZS IEC 61347.1 Lamp control gear – General and safety requirements, and \nAS/NZS IEC 61347.2.13 Lamp control gear – Particular requirements for DC or AC supplied electronic control gear for LED modules"]
["Equipment Class: LED Luminaire – Floodlight "]
["Parameter","Requirement","Documentation Requirement 1","And/Or?","Documentation Requirement 2","Documentation Required","Minimum test sample size","Commercial Lighting Acceptance OK?","VEU Acceptance OK?"]
["Lamp Circuit Power (LCP)","LCP (as Published by the Scheme Administrator) ","Test report using IES LM-79-08 or other methodology from a laboratory accredited by National Association of Testing Authorities (NATA) or equivalent body","AND","Documentation showing the laboratory is accredited to perform IES LM-79-08 (if required)","At time of product acceptance",10,"Yes","Yes"]
{"$rows_left_out":28}
{"sheet":"LED_240V_E.3","index":13,"n_rows":15,"n_cols":9,"rows_kept":15,"cut":false,"hidden":false,"merged":[[3,0,3,6]]}
["Description:","A self-ballasted LED Lamp as defined by AS/NZS 62560 Self-ballasted LED lamps for general lighting services by voltage > 50 V.  These Lamps are connected directly to a 240V supply."]
["Relevant Australian safety standard:","AS/NZS 62560: Self-ballasted LED-lamps for general lighting services by voltage > 50 V – Safety specifications"]
[null,""]
["Equipment Class: LED Lamp Only – 240V Self Ballasted"]
["Parameter","Requirement","Documentation Requirement 1","And/Or?","Documentation Requirement 2","Documentation Required","Minimum test sample size","Commercial Lighting Acceptance OK?","VEU Acceptance OK?"]
["Lamp Circuit Power (LCP)","LCP (as Published by the Scheme Administrator) ","Test report using IES LM-79-08 or other methodology from a laboratory accredited by National Association of Testing Authorities (NATA) or equivalent body","AND","Documentation showing the laboratory is accredited to perform IES LM-79-08 (if required)","At time of product acceptance",10,"Yes","Yes"]
{"$rows_left_out":10}
{"sheet":"LED_floodlight_E.3","index":14,"n_rows":33,"n_cols":9,"rows_kept":33,"cut":false,"hidden":false,"merged":[[3,0,3,6]]}
["Description:","An LED Luminaire intended for use as a floodlight as defined in AS/NZS 60598.2.5 Luminaires – Particular requirements - Floodlights"]
["Relevant Australian safety standard:","Luminaire: AS/NZS 60598.2.5 Luminaires - Particular requirements – Floodlights"]
[null,"Control Gear: AS/NZS IEC 61347.1 Lamp control gear – General and safety requirements, and \nAS/NZS IEC 61347.2.13 Lamp control gear – Particular requirements for DC or AC supplied electronic control gear for LED modules"]
["Equipment Class: LED Luminaire – Floodlight "]
["Parameter","Requirement","Documentation Requirement 1","And/Or?","Documentation Requirement 2","Documentation Required","Minimum test sample size","Commercial Lighting Acceptance OK?","VEU Acceptance OK?"]
["Lamp Circuit Power (LCP)","LCP (as Published by the Scheme Administrator) ","Test report using IES LM-79-08 or other methodology from a laboratory accredited by National Association of Testing Authorities (NATA) or equivalent body","AND","Documentation showing the laboratory is accredited to perform IES LM-79-08 (if required)","At time of product acceptance",10,"Yes","Yes"]
{"$rows_left_out":28}
{"sheet":"LED_linear_E.5","index":15,"n_rows":34,"n_cols":9,"rows_kept":34,"cut":false,"hidden":false,"merged":[[3,0,3,6],[0,1,0,6]]}
["Description:\n","An LED Luminaire intended for use as an alternative to a linear fluorescent Luminaire, where the Luminaire houses a matching Linear LED tube or a linear array of integrated LEDs. \nWhere the Luminaire uses a Linear LED tube, the Luminaire must not be compatible with a linear fluorescent Lamp."]
["Relevant Australian safety standard:","Luminaire: AS/NZS 60598.2.1 Luminaires - Particular requirements - Fixed general purpose luminaires"]
[null,"Control Gear: AS/NZS IEC 61347.1 Lamp control gear – General and safety requirements, and \nAS/NZS IEC 61347.2.13 Lamp control gear – Particular requirements for DC or AC supplied electronic control gear for LED modules"]
["Equipment Class: LED Luminaire – Linear Lamp"]
["Parameter","Requirement","Documentation Requirement 1","And/Or?","Documentation Requirement 2","Documentation Required","Minimum test sample size","Commercial Lighting Acceptance OK?","VEU Acceptance OK?"]
["Lamp Circuit Power (LCP)","LCP (as Published by the Scheme Administrator) ","Test report using IES LM-79-08 or other methodology from a laboratory accredited by National Association of Testing Authorities (NATA) or equivalent body","AND","Documentation showing the laboratory is accredited to perform IES LM-79-08 (if required)","At time of product acceptance",10,"Yes","Yes"]
{"$rows_left_out":29}
{"sheet":"LED_240V_E.11","index":16,"n_rows":14,"n_cols":9,"rows_kept":14,"cut":false,"hidden":false,"merged":[[3,0,3,6]]}
["Description:","A self-ballasted LED Lamp as defined by AS/NZS 62560 Self-ballasted LED lamps for general lighting services by voltage > 50 V.  These Lamps are connected directly to a 240V supply."]
["Relevant Australian safety standard:","AS/NZS 62560: Self-ballasted LED-lamps for general lighting services by voltage > 50 V – Safety specifications"]
[null,""]
["Equipment Class: LED Lamp Only – 240V Self Ballasted"]
["Parameter","Requirement","Documentation Requirement 1","And/Or?","Documentation Requirement 2","Documentation Required","Minimum test sample size","Commercial Lighting Acceptance OK?","VEU Acceptance OK?"]
["Base (socket type)","The lamp must have an Edison screw or bayonet base.","Product specification sheet","","","At time of product acceptance","N/A","No","No"]
{"$rows_left_out":9}
{"sheet":"LED_linear_E.13","index":17,"n_rows":34,"n_cols":9,"rows_kept":34,"cut":false,"hidden":false,"merged":[[0,1,0,6],[3,0,3,6]]}
["Description:\n","An LED Luminaire intended for use as an alternative to a linear fluorescent Luminaire, where the Luminaire houses a matching Linear LED tube or a linear array of integrated LEDs. \nWhere the Luminaire uses a Linear LED tube, the Luminaire must not be compatible with a linear fluorescent Lamp."]
["Relevant Australian safety standard:","Luminaire: AS/NZS 60598.2.1 Luminaires - Particular requirements - Fixed general purpose luminaires"]
[null,"Control Gear: AS/NZS IEC 61347.1 Lamp control gear – General and safety requirements, and \nAS/NZS IEC 61347.2.13 Lamp control gear – Particular requirements for DC or AC supplied electronic control gear for LED modules"]
["Equipment Class: LED Luminaire – Linear Lamp"]
["Parameter","Requirement","Documentation Requirement 1","And/Or?","Documentation Requirement 2","Documentation Required","Minimum test sample size","Commercial Lighting Acceptance OK?","VEU Acceptance OK?"]
["Lamp Circuit Power (LCP)","LCP (as Published by the Scheme Administrator) ","Test report using IES LM-79-08 or other methodology from a laboratory accredited by National Association of Testing Authorities (NATA) or equivalent body","AND","Documentation showing the laboratory is accredited to perform IES LM-79-08 (if required)","At time of product acceptance",10,"Yes","Yes"]
{"$rows_left_out":28}